{"text_format":"1","workbook":"xlsx","n_sheets":3,"sheets":["MANIFIESTO ","Hoja1","INFORMACION DE CLIENTES"],"not_rendered":{"charts":0,"images":2,"macros":1,"external_links":0,"defined_names":2,"comments":0,"pivot_tables":0},"unopened":[],"bounds":{"document_bytes":16777216,"sheet_cells":100000,"rows_first":2000,"rows_last":500,"rows_between":2000,"halvings":0,"cell_chars":16384,"cell_head_chars":4096},"cells_cut":0,"cells_raw":0,"read":"whole","date_system":"1900"}

{"sheet":"MANIFIESTO ","index":0,"n_rows":60,"n_cols":15,"rows_kept":60,"cut":false,"hidden":false,"merged":[[39,10,39,11],[28,0,28,1],[30,2,30,3],[24,0,24,7],[7,0,7,7],[30,4,30,5],[30,6,30,7],[41,0,41,7],[17,0,20,7],[16,0,16,7],[11,5,11,6],[8,1,8,6],[15,1,15,3],[26,5,26,6],[36,2,36,3],[32,0,32,7],[35,0,35,7],[33,0,33,7],[34,0,34,7],[30,0,30,1]]}
[]
[null,null,null,null,null,null,"FOLIO:",27102]
[]
[null,null,null,null,"MANIFIESTO PARA EL CONTROL",null,null,null,null,null,null,null,null,null,1145]
[null,null,null,null,"DE DESECHOS NO PELIGROSOS"]
[null,null,null,null,"Y LIMPIEZA DE DRENAJES",null,null,null,null,null,"                                                                                                                                                                                                                                                                                                                                                                                                                                                                                                                                                                                                                                                                                                                                                                                                                                                                                                                                                                                                                                                                                                                                                                                                                                                                                                                                                                                                                                                                                                                                                                                                                                                                                                                                                                                                                                                                                                                                                                                                                                                                                                                                                                                                                                                                                                                                                                                                                                                                                                                                                                                                                                                                                                                                                                                                                                                                                                                                                                                                                                                                                                                                                                                                                                                                                                                                                                                                                                                                                                                                                                                                                                                                                                                                                                                                                                                                                                                                                                                                                                                                                                                                                                                                                                                                                                                                                                                                                                                                                                                                                                                                                                                                                                                                                                                                                                                                                                                                                                                                                                                                                                                                                                                                                                                                                                                                                                                                                                                                                                                                                                                                                                                                                                                                                                                                                                                                                                                                                                                                                                                                                                                                                                                                                                                                                                                                                                                                                                                                                                                                                                                                                                                                                                                                                                                                                                                                                                                                                                                                                                                                                                                                                                                                                                                                                                                                                                                                                                                                                                                                                                                                                                                                                                                                                                                                                                                                                                                                                                                                                                                                                                                                                                                                                                                                                                                                                                                                                                                                                                                                                                                                                                                                                                                                                                                                                                                                                                                                                                                                                                                                                                                                                                                                                                                                                                                                                                                                                                                                                                                                                                                                                                                                                                                                                                                                                                                                                                                                                                                                                                                                                                                                                                                                                                                                                                                                                                                                                                                                                                                                                                                                                                                                                                        "]
[]
["CLIENTE"]
["RAZON SOCIAL:","METALIA MS"]
["LUGAR DE SERVICIO:"]
[]
["DOMICILIO FISCAL  ",null,null,null,"TELEFONO:",{"$f":"VLOOKUP(B9,'INFORMACION DE CLIENTES'!B2:G413,6,0)","v":8119094054}]
["CALLE :",{"$f":"VLOOKUP(B9,'INFORMACION DE CLIENTES'!B:D,3,0)","v":"OCAMPO"},null,null,"ESTADO:",{"$f":"VLOOKUP(B9,Tabla1[[NOMBRE]:[ESTADO]],5,0)","v":"NUEVO LEON"}]
["COLONIA :",{"$f":"VLOOKUP('MANIFIESTO '!B9:G9,Tabla1[[NOMBRE]:[COLONIA]],2,0)","v":"LAS ENCINAS"},null,null,"FOLIO ECOLOGIA:   ",{"$f":"VLOOKUP(B9,Tabla1[[NOMBRE]:[No. ECOLOGIA]],7,0)","v":"FSI-189-1"}]
["MUNICIPIO:",{"$f":"VLOOKUP(B9,Tabla1[[NOMBRE]:[MUNICIPIO]],4,0)","v":"ESCOBEDO"},null,null,"ASESOR COMERCIAL:",{"$f":"VLOOKUP(B9,Tabla1[[NOMBRE]:[ASESOR COMERCIAL ]],8,0)","v":"LAURA ENRIQUEZ"},null,null," "]
[]
["NOTA IMPORTANTE"]
["DECLARO BAJO PROTESTA DE DECIR VERDAD QUE LOS RESIDUOS ENTREGADOS AL TRANSPORTISTA \"CONSTRUCTORA INVERMEX SA DE CV\"  SON DE ORIGEN NO PELIGROSO, MISMOS QUE CUMPLEN CON LOS PARAMETROS QUE LAS AUTORIDADES AMBIENTALES HAN SOLICITADO, DE NO SER ASI EL CLIENTE SE HACE RESPONSABLE DE LAS SANCIONES QUE CORRESPONDAN SEGUN LAS LEYES Y REGLAMENTOS APLICABLES.",null,null,null,null,null,null,null,"."," "]
[]
[]
[]
["RESPONSABLE:",null,null,null,"FIRMA:",null,null,null,null,null,null,"  "]
["PUESTO:",null,null,null,"HORA DE SALIDA:"]
[]
["TRANSPORTISTA"]
[]
["GUZZLER","PIPA",null,"HIDRO","RP","VACTOR"]
[]
["# ECONOMICO:",null,null,"PLACAS:"]
[]
["DESCRIPCION DE RESIDUO",null,"CANTIDAD A DESCARGAR",null,"UNIDAD-VOLUMEN-PESO",null,"PRESENTACION(ESPECIFICA)"]
[]
["DESCRIPCIÓN DEL TRABAJO"]
[]
[]
[]
["NOMBRE OPERADOR:",null,null,null,"FIRMA:"]
["AYUDANTE(S):"]
["FECHA DE SERVICIO:"]
["HORA INICIO:",null,null,"HORA FINAL:",null,"TOTAL HRS:"]
[]
["DESTINO FINAL"]
[]
[]
["RESPONSABLE:",null,null,null,"FIRMA:"]
["(81)9688.7618",null,"ventas@ecoseptic.mx",null,null,"www.ecoseptic.mx"]
["Ave.A #710 y Ave.3, Central de Carga,Guadalupe N.l CP 67129",null,null,null,null,"CONSTRUCTORA INVERMEX S.A DE C.V."]
[]
[]
[]
[]
[]
[]
[]
[]
[]
[]
[]
[]
[null,null,null,null,null,null,null,null,null,null,0]

{"sheet":"Hoja1","index":1,"n_rows":45,"n_cols":15,"rows_kept":45,"cut":false,"hidden":true,"merged":[[43,13,43,14],[7,1,7,6],[10,5,10,6],[10,13,10,14],[13,9,13,14],[14,1,14,3]]}
[null,null,null,null,null,null,null,null,null,null,"Constructora Invermex S.A de C.V.",null,null,"Orden de trabajo","  "]
[null,null,"|",null,null,null,"FOLIO ",14487,null,null,"Ave. A  # 710 y Ave. 3 Central de carga"]
[null,null,null,null,null,null,null,null,null,null,"Guadalupe, Nuevo Leon"]
[null,null,null,null,"MANIFIESTO PARA EL CONTROL",null,null,null,null,null,"C.P.67129",null,null,"FOLIO: ",14243]
[null,null,null,null,"DE DESECHOS NO PELIGROSOS"]
[null,null,null,null,"Y LIMPIEZA DE DRENAJES"]
[null,null,null,null,null,null,null,null,"NOMBRE:    ",{"$f":"B8","v":"PENSKE TRUCK ARRENDADORA DE MEXICO S.A DE C.V"}]
["CLIENTE:","PENSKE TRUCK ARRENDADORA DE MEXICO S.A DE C.V",null,null,null,null,null,null,"Departamento:"]
["LUGAR DE SERVICIO:",null,null,null,null,null,null,null,"Nombre de quien solicita:"]
[null,null,null,null,null,null,null,null,"Cargo:"]
["DOMICILIO FISCAL  ",null,null,null,"TELEFONO:",{"$f":"VLOOKUP(B8,'INFORMACION DE CLIENTES'!B2:G413,6,0)","v":8189010500},null,null,"fecha de la Solicitud:",null,null,null,null,"FIRMA"]
["CALLE :",{"$f":"VLOOKUP(B8,Tabla1[[NOMBRE]:[ASESOR COMERCIAL ]],3,0)","v":"Carretera Monterrey-Colombia Km.6"},null,null,"ESTADO:","NUEVO LEÓN"]
["COLONIA :",{"$f":"VLOOKUP(B8,Tabla1[[NOMBRE]:[ASESOR COMERCIAL ]],2,0)","v":"SAN SEBASTIAN  XHALA"},null,null,"FOLIO ECOLOGIA:   ",{"$f":"VLOOKUP(B8,Tabla1[[NOMBRE]:[No. ECOLOGIA]],7,0)","v":738}]
["MUNICIPIO:",{"$f":"VLOOKUP(B8,Tabla1[[NOMBRE]:[ASESOR COMERCIAL ]],4,0)","v":0},null,null,"ASESOR COMERCIAL:",{"$f":"VLOOKUP(B8,Tabla1[[NOMBRE]:[ASESOR COMERCIAL ]],8,0)","v":"INVERMEX"},null,null,"PARTIDA","DESCRIPCION DEL TRABAJO"]
[]
[]
["GUZZLER",null,"PIPA",null,"HIDRO",null,"VACTOR"]
["SERVICIO DE LIMPIEZA DE FOSAS SEPTICAS"]
[]
["DESCRIPCION DE RESIDUO",null,"CANTIDAD TOTAL ",null,"UNIDAD-VOLUMEN-PESO",null,"PRESENTACION(ESPECIFICA)"]
[]
[]
["            NOTA IMPORTANTE: BAJO PROTESTA DECIR VERDAD CERTIFICAMOS QUE LOS DESECHOS NO PELIGROSOS"]
["              QUE SE ENTREGAN A LA COMPAÑÍA INVERMEX SA DE CV CUMPLEN CON LOS PARAMETROS QUE",null,null,null,null,null,null,null,null,null,null,null," "]
["                 LAS AUTORIDADES AMBIENTALES HAN SOLICITADO DE NO SER ASI NOS HACEMOS ACREEDORES A LAS"]
["                           SANCIONES QUE CORRESPONDAN SEGUN LAS LEYES Y REGLAMENTOS APLICABLES "]
[]
["RESPONSABLE:",null,null,null,"FIRMA:"]
["PUESTO:",null,null,null,"HORA DE SALIDA:"]
[null,null,null,"TRANSPORTISTA"]
[]
["NOMBRE OPERADOR:",null,null,null,"FIRMA:"]
["VEHICULO",null,null,null,"FECHA DE SERVICIO:"]
["MARCA:",null,null,null,"MODELO:",null,"PLACAS:"]
["# ECONOMICO:"]
["CAP.TANQUE:"]
["HORA INICIO",null,null,null,"HORA FINAL:",null,"TOTAL HRS:"]
["KM INICIAL:",null,null,null,"KM FINAL:",null,"TOTAL KMS:",null,"OBSERVACIONES"]
[null,null,null,"DESTINATARIO:"]
["EMPRESA:",null,null,null,"FECHA Y HORA DE RECEPCION:"]
["DIRECCION:",null,null,null,"TELEFONO:"]
["RESPONSABLE:",null,null,null,"FIRMA:",null,null,null,"ENTREGO",null,null,"RECIBIO"]
["(81)9688.7618",null,"ventas@ecoseptic.mx",null,null,null,null,null,null,"Nombre:"]
[null,null,null,null,null,"www.ecoseptic.mx",null,null,null,"Fecha:"]
["Ave.A #710 y Ave.3, Central de Carga,Guadalupe N.l CP 67129",null,null,null,null,"CONSTRUCTORA INVERMEX S.A DE C.V.",null,null,"Los trabajos anteriores fueron ejecutados y recibidos a nuestra entera satisfaccion y conformidad el dia ",null,null,null,null,null," "]

{"sheet":"INFORMACION DE CLIENTES","index":2,"n_rows":413,"n_cols":19,"rows_kept":413,"cut":false,"hidden":false,"merged":[]}
["CLIENTE","NOMBRE","COLONIA","CALLE","MUNICIPIO","ESTADO","TELEFONO","No. ECOLOGIA","ASESOR COMERCIAL "]
[294,"A4C-SANKIN PRECISION TUBE",null,"AMALFI","PESQUERIA","NUEVO LEON",8123533756,null,"SARAI SOLIS "]
[104,"ABASTOS Y SERVICIOS MOTRICES  S.A DE C.V.","FRACC. PARQUE INDUSTRIAL LA SILLA","AV. DE LA LIBERTAD","GUADALUPE","NUEVO LEON",8182990243,null,"INVERMEX"]
[11,"ACERO PRIME S DE RL DE CV","ZONA INDUSTRIAL","EJE 128","SAN LUIS","POTOSI",8180005301,"134/066","INVERMEX"]
[323,"ACUMULADORES OMEGA S.A. DE C.V. ","LADRILLERA ","CARR. PESQUERIA KM 1 ","PESQUERIA","NUEVO LEON",81419000,"05/2014","SARAI SOLIS "]
[250,"ADMINISTRACION DE SERVICIOS ESPECIALIZADOS ASESA, SA DE CV","SAN FERNANDO LA HERRADURA",null,"HUIXQUILUCAN","ESTADO DE MÉXICO",5544280277,null,"INVERMEX"]
[2,"ADMINISTRADORA DEL MERCADO DE ABASTOS ESTRELLA S.A DE C.V",null,"AV. LOS ANGELES 1000 OTE COL. MERCADO DE ABASTOS ESTRELLA","SAN NICOLAS DE LOS GARZA","NUEVO LEON",8183511533,null,"INVERMEX"]
[220,"ADVANCED TECHNOLOGIES EQUIPMENT AND SERVICES S.A. DE C.V.","MARIA LUISA",null,"MONTERREY","NUEVO LEON",null,null,"INVERMEX"]
[3,"AGRONUTRIENTES DEL NORTE S.A DE C.V",null,"CARRETERA A COLOMBIA","ESCOBEDO","NUEVO LEON",8181545669,"DGIA-FS-83","LAURA ENRIQUEZ"]
[353,"AISLANTES INDUSTRIALES DE MONTERREY","COYOACAN","LOS ANDES","MONTERREY","NUEVO LEON",8183558062,"19/EV-0111/02/23","SARAI SOLIS "]
[105,"ALEJANDRA GARCIA CAMACHO","CUMBRE SAN ANGEL","PRIVADA MONACO","MONTERREY","NUEVO LEON",8111637965,null,"SARAI SOLIS "]
[1,"ALEN DEL NORTE S.A DE C.V",null,"BLVD. DIAZ ORDAZ #1000","SANTA CATARINA","NUEVO LEON",8181221000,"17/804","LAURA ENRIQUEZ"]
[204,"ALFA OMEGA Y PLUS A9","LA ESTANCIA 4TO SECTOR",null,"SAN NICOLAS DE LOS GARZA","NUEVO LEON",null,null,"LUIS CASTILLO"]
[406,"ALTERIVER",null,"CARR. MONTERREY-COLOMBIA KM 11.5  ","SALINAS VICTORIA","NUEVO LEON",8110164402,"FI-445","LAURA ENRIQUEZ"]
[160,"ALTERUVER","GUERRERO","AVE. GUERRERO","NUEVO LAREDO","TAMAULIPAS",9621468622,"DGIA-FS-89","V3-LAURA"]
[117,"ALTOS HORNOS DE MEXICO S.A.B.  DE C.V","LA LOMA",null,null,"COAHUILA",null,null,"INVERMEX"]
[null,"AMIGOS DEL PATRONATO DE CERRALVO POR LA CONSERVACION DEL MEDIO AMBIENTE","DEL VALLE","CALZADA DEL VALLE ","SAN PEDRO GARZA GARCIA","NUEVO LEON",8110817961,null,"LAURA ENRIQUEZ"]
[5,"ANA GABRIELA  GONZALEZ OVALLE","VILLAS  SOL","TOMASITA VILLARREAL",null,"NUEVO LEON",8119341095,null,"INVERMEX"]
[125,"ANA GABRIELA OROZCO ZUÑIGA","ANDRES CABALLERO","FIDEL VELAZQUEZ","ESCOBEDO","NUEVO LEON",null,"FSI-358","LUIS CASTILLO"]
[274,"ANDERTON CASTINGS S. DE R.L. DE C.V.","PARQUE INDUSTRIAL LAS AMERICAS",null,"APODACA","NUEVO LEON","(81)8863-2020",null,"N/A"]
[172,"ANDRES TREJO SILVA","VILLAS CAMPESTRE",null,"CIENEGA DE FLORES","NUEVO LEON",null,null,"INVERMEX"]
[289,"ANTRIAVI","PEDRO RAMIREZ VAZQUEZ","DEL VALLE ORIENTE","SAN PEDRO GARZA GARCÍA","NUEVO LEÓN",8281144848,"DGIA2/2021","SARAI SOLIS "]
[187,"AQUA MEX S.A. DE C.V.","INDUSTRIAL EL LECHUGAL",null,"SANTA CATARINA","NUEVO LEON",null,null,"INVERMEX"]
[423,"AQUA SYSTEMS TECNOLOGIA EN AGUA","LOS ALTOS","LA BARCA","MONTERREY","NUEVO LEON",8128610945,"INTERNO","ALEJANDRA ALONSO"]
[402,"ARCELORMITTAL TUBULAR PRODUCTA MONTERREY","ARCO VIAL","CARR MONTERREY SALTILLO KM 28.2","ESCOBEDO","NUEVO LEON",9932223953,"38/2013","LUIS CASTILLO"]
[135,"ARENDAL, S.A DE C.V.","VALLE ORIENTE SECCION LOMA LARGA",null,null,"NUEVO LEON",null,null,"VERACRUZ"]
[106,"ARRENDADORA Y CONSTRUCTORA DEVCOR S.A DE C.V.","PETROLERA","PROLONGACION AGUA DULCE","TAMPICO","TAMAULIPAS",null,null,"VERACRUZ"]
[226,"ARRENDADORA Y FACTOR BANORTE,S.A DE C.V. SOCIEDAD FINANCIERA DE OBJETO MULTIPLE,ENTIDAD REGULADA,GRUPO FINANCIERO BANORT","DEL VALLE ORIENTE",null,"SAN PEDRO GARZA GARCIA","NUEVO LEON",null,null,"N/A"]
[12,"ARTEXA MEXICO S.A. DE C.V.","LA ESTANZUELA VIEJA","CAÑON GRANDE","MONTERREY","NUEVO LEON",null,null,"LUIS CASTILLO"]
[150,"ARTIGRAF S.A DE C.V.",null,"Km 1.2 S/N, Carretera a Garcia","SANTA CATARINA","NUEVO LEON",8181227300,"INTERNO","LAURA ENRIQUEZ"]
[154,"ASOCIACION DE VECINOS COLONIA ANTARA AC","ANTARA RESIDENCIAL",null,"MONTERREY","NUEVO LEON",null,null,"INVERMEX"]
[189,"ASOCIACION DE VECINOS DEL PARQUE INDUSTRIAL MILIMEX CF",null,null,null,null,null,null,"INVERMEX"]
[199,"AUTOLAVADO BOSQUES SA DE CV","EL URO",null,"MONTERREY","NUEVO LEON",null,null,"INVERMEX"]
[4,"AUTOTRANSPORTES ESPECIALIZADOS ALFA S.A DE C.V",null,"CARRETERA LIBRAMIENTO NORESTE KM 19.5","ESCOBEDO","NUEVO LEON",8118717942,null,"INVERMEX"]
[396,"AUTOTRANSPORTES LA FLECHA","INDUSTRIAL VALLEJO","PONIENTE 140","AZCAPOTZALCO","NUEVO LEON",8120018767,"FI-459","INVERMEX"]
[212,"AYVI S.A. DE C.V.","EX HACIENDA SANTA ROSA",null,"APODACA","NUEVO LEON",null,null,"INVERMEX"]
[6,"BACHOCO PPA","INDUSTRIAL","AVENIDA TECNOLOGICO","CELAYA","GUANAJUATO",8180420200,"FSI-317","LAURA ENRIQUEZ"]
[111,"BACHOCO S.A DE C.V  (INCUBADORA)","CIUDAD INDUSTRIAL","AVENIDA TECNOLOGICO",null,"GUANAJUATO",null,"FSI-316","LAURA ENRIQUEZ"]
[110,"BACHOCO S.A DE C.V  (SALINAS VICTORIA)","CIUDAD INDUSTRIAL","AVENIDA TECNOLOGICO",null,"GUANAJUATO",null,"FSI-298","LAURA ENRIQUEZ"]
[null,"BACHOCO S.A DE C.V  (SALINAS VICTORIA)","CIUDAD INDUSTRIAL","AVENIDA TECNOLOGICO",null,"GUANAJUATO",null,"FSI-298","LAURA ENRIQUEZ"]
[107,"BAFISHCO S.A DE C.V.",null,"AV. MIGUEL ALEMAN","GUADALUPE","NUEVO LEON",null,null,"INVERMEX"]
[245,"BARRY CALLEBAUT MEXICO S DE RL DE CV",null,"AVE. INDUSTRIAS DEL PONIENTE","ESCOBEDO","NUEVO LEON",8122002518,null,"LUIS CASTILLO"]
[367,"BASAL MONTERREY","PARQUE INDUSTRIAL HUINALA","INTERNACIONAL","APODACA","NUEVO LEON",null,"INTERNO","SARAI SOLIS "]
["163-1","BEBIDAS MUNDIALES",null,null,"GUADALUPE","NUEVO LEON",null,"009/2006","LAURA ENRIQUEZ"]
[163,"BEBIDAS MUNDIALES S DE RL DE CV","REGINA","AV. ALFONSO REYES NTE #3001","MONTERREY","NUEVO LEON",null,"319/2018","LAURA ENRIQUEZ"]
[370,"BILLARES POOL CASASOL","BUENOS AIRES","REVOLUCION","MONTERREY","NUEVO LEON",8183792779,null,"LUIS CASTILLO"]
[217,"BOMBAS Y BANDAS TERMOPLASTICAS S.A. DE C.V.","ZONA CENTRO",null,"APODACA","NUEVO LEON",null,null,"INVERMEX"]
[7,"BOMBAS Y MEDIDORES DEL NORTE S.A DEC.V","RINCON DE SAN MIGUEL","ORO","APODACA","NUEVO LEON",8110890812,null,"INVERMEX"]
[8,"BOTANAS Y DERIVADOS S.A DE C.V","PARQUE INDUSTRIAL KALOS","HESTIA","GUADALUPE","NUEVO LEON",8183840409,"FSI-202","LUIS CASTILLO"]
[9,"BRIDGESTONE NEUMATICOS DE MONTERREY S.A DE C.V","CIENEGA DE FLORES","AVENIDA DEL PARQUE 1000 FRACC.INDUSTRIAL MTY. TECH PARK","CIENEGA DE FLORES","NUEVO LEON",8181549227,"170/06","LAURA ENRIQUEZ"]
[112,"BUENO ALIMENTOS S.A DE C.V","FRACC. IN. UNIDAD NACIONAL","CARRETERA A SALTILLO",null,"NUEVO LEON",null,null,"INVERMEX"]
[13,"C1 ALEMANA S.A. DE C.V.","JARDIN DEL OBISPADO","Av. Jose Eleuterio Gonzalez","MONTERREY","NUEVO LEON",null,null,"LUIS CASTILLO"]
[127,"CAJA BUENOS AIRES SC DE AP DE RL DE CV","UNION MODELO",null,null,"NUEVO LEON",null,null,"INVERMEX"]
[228,"CALIDAD TOTAL EN CERAMICA  S A P I DE C V","ZONA INDUSTRIAL EL LECHUGAL","ANTIGUO CAMINO A LA HUASTECA","SANTA CATARINA","NUEVO LEON",null,"INTERNO ","LUIS CASTILLO"]
[321,"CALII-MARKET","RESIDENCIAL SANTA BARBARA 1 SECTOR","AV. LAZARO CARDENAS #1007 INT. 502","SAN PEDRO GARZA GARCIA","NUEVO LEÓN",null,"INTERNO","INVERMEX"]
[300,"CAMARA NACIONAL DE COMERCIO , SERVICIOS Y TURISMO DE MONTERREY","MONTERREY CENTRO","MELCHOR OCAMPO PONIENTE ","MONTERREY ","NUEVO LEON",null,"INTERNO ","INVERMEX"]
[255,"CARBOGRAF INDUSTRIAL, SA DE CV","PESQUERIA","CARR. MIGUEL ALEMAN KM 29.8","PESQUERIA","NUEVO LEON",81164422004,"12/2014","LUIS CASTILLO"]
[248,"CARGILL DE MEXICO, SA DE CV","SANTA FE",null,"DISTRITO FEDERAL","DISTRITO FEDERAL",null,null,"VERACRUZ"]
[261,"CARGILL PROTEIN S DE RL DE CV","SANTA FE","AV. ANTONIO DOVALI JAIME #70 TORRE C Y D PISO 11","ALVARO OBREGÓN","CIUDAD DE MÉXICO",null,null,"V3-LAURA ENRIQUEZ"]
[361,"CARLOS BLANCO MARTINEZ","SALTILLO 2000","ALMENDRO #701","SALTILLO","COAHUILA",8110490775,"INTERNO","INVERMEX"]
[14,"CARNES  FINAS SAN JUAN CONTRY S.A  DE C.V.","VILLA DEL RIO","PROL. ALFONSO REYES",null,"NUEVO LEON",null,null,"SARAI SOLIS "]
[18,"CARNES FINAS SAN JUAN ",null,null,null,"NUEVO LEON",null,null,"SARAI SOLIS "]
[318,"CARNES FINAS SAN JUAN ANAHUAC","ANAHUAC","AV. MANUEL L. BARRAGAN #6400","SAN NICOLAS DE LOS GARZA","NUEVO LEON",null,"INTERNO","SARAI SOLIS "]
[15,"CARNES FINAS SAN JUAN LINCOLN, S.A DE C.V.","PUERTA DE HIERRO","ABRAHAM LINCOLN",null,"NUEVO LEON",null,null,"SARAI SOLIS "]
[16,"CARNES FINAS SAN JUAN LINDA VISTA S.A. DE C.V.","LIBERTAD","AV. MIGUEL ALEMAN","GUADALUPE","NUEVO LEON",null,null,"SARAI SOLIS "]
[17,"CARNES FINAS SAN JUAN RIOJA SA DE CV","Valle del Huajuco","CARRETERA LIBRE FEDERAL NACIONAL","MONTERREY","NUEVO LEON",null,null,"SARAI SOLIS "]
[313,"CARNES FINAS SAN JUAN SENDERO","CENTRO DE DESARROLLO COMUNITARIO CEDECO","AV. SENDERO DIVISORIO #300","SAN NICOLAS DE LOS GARZA","NUEVO LEON",null,"INTERNO","SARAI SOLIS "]
[253,"CAROLINA RODRIGUEZ SOTO","MITRAS NORTE","Av. Manuel L. Barragán 701","MONTERREY","NUEVO LEON","81 1958 6100",null,"INVERMEX"]
[19,"CARRIER  MEXICO S.A. DE C.V.","EL LECHUGAL","GALEANA OTE","SANTA CATARINA","NUEVO LEON",null,null,"INVERMEX"]
[287,"CASCO TRANSPORTES SA DE CV","CENTRO ","CARRETERA MIGUEL ALEMAN","APODACA ","NUEVO LEÓN",8120408982,"004/2007","SARAI SOLIS "]
[302,"CEDICARNES FOODS ","COLONIAL LAGRANGE","AVENIDA ADOLFO LOPEZ MATEOS L2 INTERIOR 200","SAN NICOLAS","NUEVO LEON",8180304440,"INTERNO ","INVERMEX"]
[197,"CEMM MEX SA DE CV","29 DE JULIO",null,"GUADALUPE","NUEVO LEON",null,null,"LUIS CASTILLO"]
[20,"CENTRIFUGADOS MEXICANOS S.A DE C.V",null,"CARRETERA A TESISTAN KM 8",null,"JALISCO",null,null,"INVERMEX"]
[292,"CENTRO LLANTERO RAGA SA DE CV ","REGIO PARQUE INDUSTRIAL","AV. REGIO PARQUE N°115 A","APODACA","NUEVO LEON",8181560500,"FSI-284","LAURA ENRIQUEZ"]
[376,"CENTRO RESTAURANTERO TJ S DE RL DE CV","10 DE MAYO","PROL FRANCISCO I MADERO","GUADALUPE","NUEVO LEON",8136458930,"INTERNO","LUIS CASTILLO"]
[21,"CHRISTUS MUGUERZA SISTEMAS HOSPITALARIOS SA DE CV","LA ESTANZUELA (F-45)","CARRETRA NACIONAL","MONTERREY","NUEVO LEON",8181555000,16091,"INVERMEX"]
[133,"CI HEAVY INDUSTRIES, S.A DE C.V","BOSQUES DE LAS LOMAS  34",null,null,"CIUDAD DE MEXICO",null,null,"VERACRUZ"]
[144,"CIF ALMACENAJES Y SERVICIOS SA DE CV",null,null,null,"VERACRUZ",null,null,"VERACRUZ"]
[22,"CLASE AUTOMOTRIZ SA DE CV","VALLE OTE.","AV. LAZARO CARDENAS","SAN PEDRO GARZA GARCIA","NUEVO LEON",null,null,"INVERMEX"]
[23,"CLEBER TE MUEVE S.A  DE C.V.",null,"LIBRAMIENTO SALTILLO NUEVO LAREDO",null,"NUEVO LEON",8119668800,"082/08","INVERMEX"]
[151,"CLIENTE PARTICULAR","XXXX",null,"X","XXX",null,null,"N/A"]
[400,"CLUB DE FUTBOL MONTERREY RAYADOS ","LA PASTORA ","AV. PABLO LIVAS #2011","GUADALUPE","NUEVO LEON ",null,"166/2019","SARAI SOLIS "]
[24,"COLEGIO DE BACHILLERES MILITARIZADO GENERAL MARIANO ESCOBEDO DEL ESTADO DE NUEVO LEON","SAN BERNABE VIII ( F-125)","PROLONGACION AZTLAN","MONTERREY","NUEVO LEON",null,null,"INVERMEX"]
[25,"COLEGIO DE ESTUDIOS CIENTÍFICOS Y TECNOLÓGICOS DEL ESTADO DE NUEVO LEON",null,"ANDES",null,"NUEVO LEON",null,"FSI-288","LUIS CASTILLO"]
[26,"COMERCIALIZADORA DE POLLOS Y CARNES YESAKI SA DE CV","Palmas Diamante","AVE ORION","SAN NICOLAS DE LOS GARZA","NUEVO LEON",null,null,"LUIS CASTILLO"]
[186,"COMERCIALIZADORA DE PRODUCTOS LACTEOS DE LA LAGUNA  S.A. DE C.V.","QUINTAS SAN ISIDRO",null,"COAHUILA","TORREON",null,null,"INVERMEX"]
[128,"COMPAÑIA GENERAL DE SERVICIOS S.A DE C.V.",null,null,null,"NUEVO LEON",null,null,"INVERMEX"]
[279,"COMPAÑIA TOPO CHICO S. DE R.L. DE C.V","TOPO CHICO","MONTERREY #6500","MONTERREY","NUEVO LEON",null,"048/2016","LAURA ENRIQUEZ"]
[356,"COMPRAS Y SERVICIOS GUGA","DEL VALLE","RIO ORINOCO","SAN PEDRO","NUEVO LEON",8116608612,null,"INVERMEX"]
[27,"CONCRETOS APASCO S.A DE C.V.","AGOSTADERO DEL PALMAR","ANTIGUO CAMINO A MINERA DEL NORTE","SANTA CATARINA","NUEVO LEON",null,null,"INVERMEX"]
[225,"CONMET DE MEXICO SA DE CV",null,"AV. LAS AMERICAS #100","CIENEGA DE FLORES","NUEVO LEON",null,"¨775/04","LUIS CASTILLO"]
[262,"CONSTRUCTORA INDUSTRIAL ORNELAS TREJO, SA DE CV","SANTA MONICA",null,"JUAREZ","NUEVO LEON",8116035842,null,"INVERMEX"]
[272,"CONTAINER CARE ICAVE SA DE CV","CENTRO",null,"VERACRUZ","VERACRUZ","229 989 7000 ext 6502",null,"VERACRUZ"]
[190,"CONTROL Y OPERACION DE INMUEBLES SA DE CV","HUIXIQUILCAN DE DEGOLLADO",null," CENTRO HUIXIQUILCAN","MEXICO",null,null,"INVERMEX"]
[384,"CONTROLADORA IDEA SA DE CV","DULCES NOMBRES","PERIFERICO DE CUOTA KM 57","APODACA","NUEVO LEON",8135322215,"06NVL154137/24EROC14","LUIS CASTILLO"]
[28,"COPAMEX INDUSTRIAS SA DE CV","CUAUHTEMOC","AVE DE LA JUVENTUD","GUADALUPE","NUEVO LEON",null,"INTERNO","SARAI SOLIS "]
[29,"CORPORACION SIERRA MADRE S.A. DE C.V.",null,"CARRETERA  GARCIA KM 8.5","GARCIA","NUEVO LEON",null,"FSI-305","INVERMEX"]
[301,"CORRUGADOS LOGO ","GENERAL ESCOBEDO  C.P 66062","CALLE INDUSTRIA ELECTRONICA #500","GENERAL ESCOBEDO","NUEVO LEON",null,"INTERNO","LAURA ENRIQUEZ"]
[162,"CORSA TRANSPORTES SA DE CV","LIBRAMIENTO NORESTE",null,null,"GENERAL ESCOBEDO",null,null,"LUIS CASTILLO"]
[141,"CPD ALIMENTOS S.A DE C.V.","OBRERA",null,null,"NUEVO LEON",null,null,"LUIS CASTILLO"]
[257,"CPROBISE DE MEXICO, S DE RL DE CV","INDEPENDENCIA",null,"MONTERREY","NUEVO LEON",8182542430,null,"INVERMEX"]
[208,"CRISTALES INASTILLABLES DE MEXICO SA DE CV","SIN COLONIA","CARR. A GARCIA K.M 10.3","GARCIA","NUEVO LEON",null,"INTERNO","LUIS CASTILLO"]
[31,"CRYOINFRA S.A. DE C.V.","EL PARQUE","FELIZ GUZMAN","NAUCALPAN DE JUAREZ","ESTADO DE MEXICO",null,null,"INVERMEX"]
[183,"ROCA BATHROOM PRODUCTS MEXICO","TORRES DE SANTO DOMINGO",null,"SAN NICOLAS","NUEVO LEON",null,null,"LUIS CASTILLO"]
[169,"DAE HAN MEXICO SA DE CV","MONTERREY TECHNOLOGY PARK",null,"CIENEGA DE FLORES","NUEVO LEON",null,null,"INVERMEX"]
[305,"DAWN-MIXCO INTERNACIONAL","LOMAS DE SOTELO","BOULEVARD MANUEL AVILA CAMACHO  #5 TORRE B PISO 27","NAUCALPAN DE JUAREZ","ESTADO DE MEXICO",null,"INTERNO","LUIS CASTILLO"]
[32,"DELICIAS GARZA VILLARREAL SA DE CV","LOS SAUCES","COLON","GUDALUPE","NUEVO LEON",null,null,"INVERMEX"]
[201,"DELIPRIME ALIMENTOS S.A. DE C.V.","PARQUE INDUSTRIAL ESCOBEDO",null,"ESCOBEDO","NUEVO LEON",null,null,"LUIS CASTILLO"]
[303,"DESARROLLO DE ENGORDAS ESTABULADAS","COYOACAN","AVENIDA LOS ANDES #700","MONTERREY","NUEVO LEÓN",8112447800,"29073-1","LUIS CASTILLO"]
[258,"DESARROLLO Y CONSTRUCCIONES URBANAS, SA DE CV","SANTA MARIA",null,"MONTERREY","NUEVO LEON",8111584200,null,"INVERMEX"]
[258,"DESARROLLO Y CONSTRUCCIONES URBANAS, SA DE CV"]
[205,"DEYANIRA GUILLEN TORRES","PUENTE MORENO",null,"MEDELLIN","VERACRUZ",null,null,"N/A"]
[33,"DISTRIBUIDORA ALCALI SA DE CV","CENTRO VILLA DE GARCIA (CASCO)","CARRETERA MUNICIPAL MONTERREY GARCIA","GARCIA","NUEVO LEON",null,null,"INVERMEX"]
[329,"DISTRIBUIDORA ARCA CONTINENTAL","BELLA VISTA","CARR NACIONAL 575","SABINAS HIDALGO","NUEVOLEON",null,null,"SARAI SOLIS "]
[259,"DISTRIBUIDORA DE COMBUSTIBLES MEXICANOS, SA DE CV","LOMA DEL BARIIO DEL CARDONAL",null,"ATITALAQUIA","HIDALGO",7787380432,"44/2015","INVERMEX"]
[null,"DLG INDUSTRIAS",null,"CARR. LIBRE MUNICIPAL PESQUERIA DULCES NOMBRESW","PESQUERIA","NUEVO LEON",null,"FSI-387","PATRICIO"]
[495,"DMTC TECHNOLOGY SERVICES","PARQUE INDUSTRIAL FINSA MONTERREY GUADALUPE","DESARROLLO  540","GUADALUPE","NUEVO LEON",null,"INTERNO","OMAR MORENO"]
[391,"DUROSA","INDUSTRIAL NOGALAR","FUTURO NOGALAR","SAN NICOLAS","NUEVO LEON",8183534101,"INTERNO","LUIS SOTO"]
[34,"ECOFLU, S.A DE C.V","COLINAS DEL AEROPUERTO","AV. CENTRAL","PESQUERIA","NUEVO LEON",null,null,"N/A"]
[234,"EFFEM MEXICO INC Y COMPAÑIA S EN NC DE CV","EL MARQUES","CARR CHICHIMEQUILLAS KM 4.5","QUERÉTARO","QUERETARO",null,".","LUIS CASTILLO"]
[315,"ELECTRICA AUTOMOTRIZ OMEGA ","INDUSTRIAL","AVE PARQUE INDUSTRIAL","DOCTOR GONZALEZ","NUEVO LEON",null,null,"SARAI SOLIS "]
[35,"ELECTROMONTAJES  S.A. DE C.V.",null,"JULIAN VILLAGRAN","MONTERREY","NUEVO LEON",null,null,"INVERMEX"]
[400,"EMPACADORA SAMAGO","PARQUE INDUSTRIAL JM","AVENIDA R.R. #308","APODACA","NUEVO LEON",8183341513,"INTERNO","LUIS CASTILLO"]
[200,"EMPACADORA SUPREMO DE MONTERREY S.A. DE C.V.","LA GRANGE",null,"SAN NICOLS DE LOS GARZA","NUEVO LEON",null,null,"LUIS CASTILLO"]
[230,"EMPACADORA Y PROCESADORA DE MONTERREY S.A. DE C.V.","SCOP",null,"GUADALUPE","NUEVO LEON",null,null,"LUIS CASTILLO"]
[399,"EMPAQUES MOLDEADOS DE AMERICA TECNOLOGIAS",null,"ISIDRO SEPULVEDA ","APODACA","NUEVO LEON",8113341156,"INTERNO","INVERMEX"]
[210,"ENERGY & CONTROLS DE MEXICO SA DE CV",null,null,"PARAISO","TABASCO",null,null,"N/A"]
[349,"ENERYA SA DE CV",null,"CARR A GARCIA KM 1.2","SANTA CATARINA","NUEVO LEON",8181533100,"INTERNO","LAURA ENRIQUEZ"]
[null,"ESTILOS ARQUITECTONICOS",null,null,"CADEREYTA","NUEVO LEON",null,"N/A","LAURA ENRIQUEZ"]
[291,"ETN TURISTAR LUJO","NUEVA INDUSTRIAL VALLEJO","SATURNO  #35","GUSTAVO A MADERO","CD DE MEXICO",null,"07/017","SARAI SOLIS "]
[131,"EXCELLENCE SEA & LAND LOGISTICS, S.A. DE C.V.","BOSQUES DE LAS LOMAS",null,null,"CIUDAD DE MEXICO",null,null,"VERACRUZ"]
[173,"FABRICACIONES Y MAQUINADOS PARA LA INDUSTRIA SA DE CV","FRACCIONAMIENTO INDUSTRIAL",null,"FRONTERA","COAHUILA",null,null,"INVERMEX"]
[156,"FABRICACIONES Y SERVICIOS DE MEXICO SA DE CV","CALIFORNIA",null,"CASTAÑOS","COAHUILA",null,null,"INVERMEX"]
[299,"FABRICANTES DE EQUIPOS PARA REFRIGERACION ","JARDINES DE GUADALUPE","DIA DEL EMPRESARIO #901","GUADALUPE ","NUEVO LEON ",null,"FSI-289","LUIS CASTILLO"]
[155,"FABRICANTES Y SERVICIOS DE MEXICO SA D ECV","CALIFORNIA",null,"CASTAÑOS","COAHUILA",null,null,"INVERMEX"]
[407,"FACILITIES CORP","OTRA NO ESPECIFICADA","AV. ARCO VIAL # 201 CALLE 3 INT 4","APODACA","NUEVO LEON",8120103659,"INTERNO","LUIS CASTILLO"]
[36,"FAMILY DINE FOODS S.A. DE C.V",null,"AV. JOSE VASCONCELOS",null,null,null,null,"INVERMEX"]
[284,"FASTOS OPERADORA DE HOTELES SA DE CV","CENTRO",null,"MONTERREY","NUEVO LEON",8112333500,"FI-449","SARAI SOLIS "]
[351,"FENO RESINAS","DEL VALLE","DIVISION DEL NORTE","BENITO JUAREZ","CIUDAD DE MEXICO",818305685,"INTERNO","SARAI SOLIS "]
[278,"FERRETERIA INDUSTRIAL DEL NORTE S.A. DE C.V.","BELLA VISTA",null,"MONTERREY","NUEVO LEON",null,"INTERNO ","LUIS CASTILLO"]
[389,"FLUIDOS INDUSTRIALES MEXICANOS","MONTERREY TECHNOLOGY PARK","TECNOLOGICO","CIENEGA DE FLORES","NUEVO LEON",8183847310,null,"LUIS SOTO"]
[null,"FOMENTO DEPORTIVO, SOCIAL Y CULTURAL","CENTRO ","CARRETERA LIBRE ESTATAL A REYNOSA","JUAREZ","NUEVO LEON",null,"INTERNO","LUIS CASTILLO"]
["-","FORJA DE MONTERREY ","-","-",null,"NUEVO LEON","-",331,"INVERMEX"]
[37,"FORTACERO SA DE CV","APODACA CENTRO","BLVD CARLOS SALINAS","APODACA","NUEVO LEON",null,"0512/AR/23","ALEJANDRA ALONSO"]
[327,"FORTEQUIM SA DE CV","HACIENDA LA ESPAÑOLA","CARR. SN MIGUEL KM 5","GUADALUPE","NUEVO LEON",null,"INTERNO","LUIS CASTILLO"]
[38,"FR TERMINALES SA DE CV","DEL VALLE","DIVISION DEL NORTE","BENITO JUAREZ","CIUDAD DE MEXICO",null,null,"LUIS CASTILLO"]
[175,"FURIA MOTORS MONTERREY S.A. DE C.V.","VALLE ORIENTE",null,"SAN PEDRO","NUEVO LEON",null,null,"LUIS CASTILLO"]
[414,"GAIM REGIOMONTANA","VALLE DEL MIRADOR","FUNDADORES","MONTERREY","NUEVO LEON",8135519916,"SMA049","LAURA ENRIQUEZ"]
[39,"GC TRATAMIENTO S.A DE C.V",null,"CUERNAVACA","MONTERREY","NUEVO LEON",null,null,"INVERMEX"]
[40,"GEMTRON DE MEXICO S.A. DE C.V.","PARQUE INDUSTRIAL MILENIUM","BOULVEARD T.L.C.","APODACA","NUEVO LEON",null,".","SARAI SOLIS "]
[324,"GEOEX SA DE CV","CIRCUNVALACION GUEVARA","HOSPITAL #1759","GUADALAJARA","JALISCO",null,"INTERNO","SARAI SOLIS "]
[41,"GLIDER MONTERREY S DE RL DE CV","LOMAS HIPODROMO","DEL CONSCRIPTO","NAUCALPAN DE JUAREZ","MEXICO",null,null,"SARAI SOLIS "]
[209,"GLOBAL FACILITIES MANAGEMENT S.A.P.I DE C.V.","MARIA LUISA",null,"MONTERREY","NUEVO LEON",null,null,"INVERMEX"]
[42,"GOBIERNO DEL ESTADO DE NUEVO LEON","CENTRO  WASHINGTON   Y 5 DE MAYO","ESCOBEDO SUR","MONTERREY","NUEVO LEON",null,null,"N/A"]
[338,"GONHER DE MEXICO SA DE CV","CENTRO","AV. MANUEL ORDOÑEZ #600","SANTA CATARINA","NUEVO LEON",null,"302/19","LAURA ENRIQUEZ"]
[213,"GRAFTECH MEXICO S.A. DE C.V.",null,"Carretera Miguel Aleman Km. 20 #600","APODACA","NUEVO LEON",8181355700,"ADFRG-048 ","LUIS CASTILLO"]
[317,"GRUPO COLLADO","GUADALUPE DEL MORAL","AV. GAVILAN #200","CIUDAD DE MEXICO","CDMX",8181960000,"INTERNO","V3-LAURA ENRIQUEZ"]
[43,"GRUPO GOVIMOSA SA DE CV","CENTRO","MIGUEL NIETO","MONTERREY","NUEVO LEON",null,null,"INVERMEX"]
[44,"GRUPO MAPUCHE SA DE CV","VILLA LOS PINOS","ALFONSO REYES","MONTERREY","NUEVO LEON",null,"155/2018","INVERMEX"]
[376,"GRUPO RESTAURANTERO TJ","10 DE MAYO","PROL FRANCISCO I MADERO","GUADALUPE","NUEVO LEON",8136458930,null,"LUIS CASTILLO"]
[45,"GRUPO ROLSE S.A DE C.V.",null,"WASHINGTON","MONTERREY","NUEVO LEON",null,null,"INVERMEX"]
[397,"GTC TERMO CONTROL","BELLA VISTA","AV. BERNARDO REYES #2804","MONTERREY","NUEVO LEON",8122024401,"INTERNO","INVERMEX"]
[365,"GUADALUPE HUMBERTO RODRIGUEZ LOPEZ","HUINALA","CARR APODACA JUAREZ 1030","APODACA","NUEVO LEON",8112770315,"INTERNO","LAURA ENRIQUEZ"]
[275,"GUILLERMO GUTIERREZ AGUIRRE","PROGRESO",null,"MONTERREY","NUEVO LEON",null,null,"LUIS CASTILLO"]
[332,"HAMMOND POWER SOLUTIONS S.A. DE C.V. ","PARQUE INDUSTRIAL GUADALUPE","AV. AVANTE #810","GUADALUPE","NUEVO LEON",null,"3619/SPMARN-CCA/21","INVERMEX"]
[46,"HARI MASA S.A. DE C.V.",null,"CARRETERA A VILLA DE GARCIA KM 8.8","SANTA CATARINA","NUEVO LEON",null,"FSI-222"]
[116,"HARZ MEXICANOS S.A DE  C.V","NUEVA SANTA CATARINA",null,null,"NUEVO LEON",null,"30/12.","SARAI SOLIS "]
[277,"HECTOR JAVIEL ALANIS SIERRA","ARGENTINA",null,null,"NUEVO LEON",null,null,"INVERMEX",null,null,"CENTRAL DE CARGA","GUADALUPE","NUEVO LEON","81 83774252",null,null,0,6]
[null,"HEINEKEN S.A DE C.V",null,null,null,null,null,"INTERNO","LAURA ENRIQUEZ"]
[227,"HELADOS SULTANA DE MONTERREY, S.A. DE C.V.","COL. CENTRO",null,"MONTERREY","NUEVO LEON",null,null,"LUIS CASTILLO"]
[374,"HERCULES CONSTRUCCIONES DE MONTERREY","FIERRO","CHURUBUSCO","MONTERREY","NUEVO LEON",8116272186,null,"LUIS CASTILLO"]
[238,"HERSAFORES, S.A. DE C.V.","PARQUE INDUSTRIAL EL CARMEN",null,"EL CARMEN","NUEVO LEON",null,null,"INVERMEX"]
[223,"HERSMEX S. DE R.L. DE C.V.","CENTRO","AVENIDA INDUSTRIAS DEL PONIENTE","GENERAL ESCOBEDO","NUEVO LEON",null,"260/2021","LUIS CASTILLO"]
[229,"HG TRANSPORTACIONES, S.A. DE C.V.","EL MILAGRO",null,"APODACA","NUEVO LEON",null,null,"LUIS CASTILLO"]
[246,"HYUNDAI GLOVIS MEXICO S. DE R.L. DE C.V","LA ARENA ","CARR. MUNICIPAL PESQUERIA-LOS RAMONES KM 13 AL 15","PESQUERIA","NUEVO LEON",8147808230,"DGIA-FS-45","LUIS CASTILLO"]
[335,"HYUNDAI STEEL MEXICO S DE RL DE CV","LA ARENA ","CARR. MUNICIPAL PESQUERIA-LOS RAMONES KM 13 AL 15","PESQUERIA","NUEVO LEON",null,"DGIA-FS-45","LUIS CASTILLO"]
[380,"I.N.G.E.T.EK.N.O.S ESTRUCTURALES","SN   ","LIBRAMIENTO NORESTE KM11+200","GARCIA","NUEVO LEON",5542682256,"FSI-131","LUIS CASTILLO"]
[241,"IBERDROLA ENERGÍA ESCOBEDO, SA DE CV","LOMAS DE CHAPULTEPEC",null,"MIGUEL HIDALGO","CIUDAD DE MÉXICO",8186254600,null,"LUIS CASTILLO"]
[215,"IBERDROLA ENERGIA MONTERREY S.A. DEC.V.","LOMAS DE CHAPULTEPEC I SECCION",null,"DISTRITO FEDERAL","CIUDAD DE MEXICO","018186254600 EXT.1017","209/2021","LUIS CASTILLO"]
[114,"IEMS AMERICA",null,null,null,null,null,null,"N/A"]
[122,"IEMS AMERICAS, S.C.",null,null,null,"NUEVO LEON",null,null,"N/A"]
[368,"IMERYS CERAMICS MEXICO","EJIDO JUAREZ","AUTOPISTA MONTERREY CADEREYTA KM 20","JUAREZ","NUEVO LEON",8111574180,"FSI-257","INVERMEX"]
[47,"IMPULSORA PLAZA JUAREZ","Parque Industrial Kuadrum","KAPPA","APODACA","NUEVO LEON",null,null,"INVERMEX"]
[48,"IMPULSORA REGIO HOGAR S.R.L. DE C.V.","MONTE DE LOS OLIVOS","CALLEJON DE LOS CUATRO DIAS","SANTA CATARINA","NUEVO LEON",null,null,"INVERMEX"]
[206,"INDUSTRIA DEL ALCALI, S.A. DE .C.V.","SIN COLONIA","CARR A GARCIA KM 9","GARCIA","NUEVO LEON",null,null,"LUIS CASTILLO"]
[387,"INDUSTRIAL Y COMERCIAL GAGU","ANDRES M CABALLERO","JESUS MARTINEZ #4130","ESCOBEDO","NUEVO LEON",8117962711,"No Reg #042","LAURA ENRIQUEZ"]
[242,"INDUSTRIAS TUK, SA DE CV","VALLE DEL MEZQUITAL",null,"APODACA","NUEVO LEON",8182217400,null,"INVERMEX"]
[194,"INFRA S.A. de C.V.","NOGALAR","Guerrero Nte. 3000","SAN NICOLAS DE LOS GARZA","NUEVO LEON",null,null,"SARAI SOLIS "]
[344,"INFRAESTRUCTURA E INTERIORES SA DE CV","NAPOLES","MONTECITO #38 PISO 29 OF 34","CIUDAD DE MEXICO","CIUDAD DE MEXICO",null,null,"LUIS CASTILLO"]
[49,"INMOBILIARIA PAISAJES DEL HUAJUCO, S.A. DE C.V","EL LECHUGAL","CARRETERA FEDERAL MONTERREY - SALTILLO","SANTA CATARINA","NUEVO LEON",null,null,"INVERMEX"]
[251,"INMOBILIARIA PROTERRA, SA DE CV","CENTRO","CRISTOBAL COLON 1301","MONTERREY","NUEVO LEÓN",null,null,"LUIS CASTILLO"]
[168,"INMOBILIARIA SEO SA DE CV","BAHIA DE PRIMAVERA",null,"MONTERREY","NUEVO LEON",null,null,"INVERMEX"]
[342,"INSTANT FOODS DE MEXICO S.A DE C.V","EL LECHUGAL","GALEANA ","SANTA CATARINA","NUEVO LEON",8112470400,29352,"LUIS CASTILLO"]
[50,"INSTITUTO DE CAPACITACION Y EDUCACION PARA EL TRABAJO A.C.","CENTRO MONTERREY","FELIX U GOMEZ","MONTERREY","NUEVO LEON",null,null,"N/A"]
[243,"INSTITUTO DE SEGURIDAD Y SERVICIOS SOCIALES DE LOS TRABAJADORES DEL ESTADO","CUAUTHEMOC",null,"CUAUHTEMOC","CIUDAD DE MEXICO",null,null,"LUIS CASTILLO"]
[51,"INSTITUTO TECNOLOGICO Y DE ESTUDIOS SUPERIORES DE MONTERREY",null,"AV EUGENIO GRAZA SADA","MONTERREY","NUEVO LEON",null,null,"SARAI SOLIS "]
[52,"INTEGRADORA DE INSUMOS DEL NORESTE S.A DE C.V","COLINAS DE SAN JERONIMO","BLVD. PUERTA DEL SOL","MONTERREY","NUEVO LEON","81 8305 3000","212/08","LUIS CASTILLO"]
[53,"INTELIGENT MANAGEMENT DE MEXICO S.A DE C.V.","TREVIÑO","AV. VICENTE GUERRERO","MONTERREY","NUEVO LEON",null,null,"INVERMEX"]
[171,"INTERNACIONAL DE CONTENEDORES ASOCIADOS DE VERACRUZ SA DE CV",null,null,null,null,null,null,"VERACRUZ"]
[136,"INTERNATIONAL PAPER MEXICO COMPANY S DE R.L DE C.V.","SAN JOSE DE ITURBIDE","AV. BICENTENARIO #372","SAN JOSE DE ITURBIDE","GUANAJUATO",null,"INTERNO","SARAI SOLIS "]
[290,"IQUISA NORESTE","AV. RICARDO MARGAIN ZOZAYA","VALLE DEL CAMPESTRE","SAN PEDRO GARZA GARCIA","NUEVO LEÓN",null,"INTERNO ","LUIS CASTILLO"]
[129,"IRKON CONCESIONES S.A DE C.V.","EL MOLINITO",null,null,"CIUDAD DE MEXICO",null,"197/06","INVERMEX"]
[364,"IRVIN SANTIAGO RIOS","LOS PAJAROS","AV. MIGUEL HIDALGO 1 LOTE 5 EDIF 5 INT 201","CUAUTITLAN IZCALLI","MEXICO",null,"INTERNO","INVERMEX"]
[390,"J&J LUBRICANTES",null,"CARR SALINAS VICTORIA 5.5","SALINAS","NUEVO LEON",8181547300,"130/08","LAURA ENRIQUEZ"]
[165,"JAITER SA DE CV","LAS ENCINAS","Av. JARDINES DEL CANADA #328","ESCOBEDO","NUEVO LEON","81 8397 6645","INTERNO","LUIS CASTILLO"]
[203,"JEVEMS SOLUCIONES INTEGRALES, S.A. DE C.V.","CUAUHTEMOC",null,"SAN NICOLAS DE LOS GARZA","NUEVO LEON",null,null,"INVERMEX"]
[355,"JIT MACHINING SERVICES","LA COMEDIA","SAN SEBASTIAN 400","GUADALUPE","NUEVO LEON",8121106728,null,"LUIS CASTILLO"]
[157,"JOAQUIN VICENTE DEL REAL CAÑAMAR","VALLE DE ANAHUAC",null,"SAN NICOLAS DE LOS GARZA","NUEVO LEON",null,null,"INVERMEX"]
[427,"JOHNSON CONTROLS ENTERPRISES MEXICO","ZONA VALLE ORIENTE","DAVID ALFARO SIQUEIROS","SAN PEDRO GARZA GARCIA","NUEVO LEON",null,null,"LAURA ENRIQUEZ"]
[54,"JORGE CASTAÑEDA OCHOA","PEDREGAL DE LINDA VISTA 2DO SECTOR","BELFAST","GUADALUPE","NUEVO LEON",null,null,"INVERMEX"]
[211,"JOSE ALBERTO MUÑOZ REYES","FOMERREY SANTA MARTHA",null,"ESCOBEDO","NUEVO LEON",null,null,"N/A"]
[372,"JOSE ALEJANDRO GOSSIO CAMACHO","JARDIN","VIOLETA","TAMAULIPAS","TAMAULIPAS",8182082503,null,"LUIS CASTILLO"]
[231,"JOSE MARIA RODRIGUEZ SANCHEZ","CUAUHTEMOC",null,"SAN NICOLAS","NUEVO LEON",null,null,"INVERMEX"]
[55,"JUGOS DEL VALLE S A P I DE C V","BARRIO TEXCACOA","INSURGENTES","TEPOZTLAN","ESTADO DE MEXICO",null,"208/2017","INVERMEX"]
[null,"JULIO CESAR TORRES REYES","LAS PUENTES SECTOR 4","MONTES CARPATOS","SAN NICOLAS DE LOS GARZA","NUEVO LEON",null,"INTERNO","LUIS CASTILLO"]
[143,"JUMBO CEL S.A DE C..V","SANTA ROSA",null,null,"NUEVO LEON",null,null,"INVERMEX"]
[56,"JUNIOR FOODS S.A. DE C.V.","SIN COLONIA","BLVD. ANTONIO L. RODRIGUEZ","MONTERREY","NUEVO LEON",null,null,"INVERMEX"]
[221,"KANDELIUM MEXICO S DE RL DE CV",null,"CARRETERA A GARCÍA KM 8.5","GARCIA","NUEVO LEON","81 50 29 00","106/04","LUIS CASTILLO"]
[280,"KATCON S.A DE C.V","CENTRO",null,"SANTA CATARINA","NUEVO LEON","8115777535 / 8180444000",null,"INVERMEX"]
[166,"KAYAKU SAFETY SYSTEMS DE MEXICO SA DE CV","EX HACIENDA SAN ISIDRO",null,"SALINAS VICTORIA","NUEVO LEON",8182883550,"133/2020","SARAI SOLIS "]
[236,"KOHLER SANIMEX, S. DE R.L. DE C.V.","FRACC. LOMAS DEL SOL",null,"JUAREZ","NUEVO LEON",null,null,"INVERMEX"]
[395,"LA CAPITAL DE SELLADAS DEL MUNDO","PARQUE INDUSTRIAL FINSA MONTERREY","BOULEVARD TRATADO DE LIBRE COMERCIO","APODACA","NUEVO LEON",8183316346,null,"INVERMEX"]
[281,"LA INDUSTRIA DE MUEBLES CERAMICOS S.A DE C.V","SAN CARLOS",null,"GUADALAJARA","JALISCO",null,null,"INVERMEX"]
[260,"LADRILLERA MECANIZADA S.A. DE C.V.","VALLE ORIENTE",null,"SAN PEDRO GARZA GARCIA","NUEVO LEON",8181333000,null,"INVERMEX"]
[142,"LAMINA Y PLACA COMERCIAL  S.A DE C.V.","CENTRO",null,null,"NUEVO LEON",null,null,"INVERMEX"]
[269,"LAPESA TELEFAR SA DE CV","EL CERCADO",null,"SANTIAGO","NUEVO LEON","81 2285  3325",null,"INVERMEX"]
[232,"LAS MISIONES CLUB CAMPESTRE AC","EL CERRITO","Antiguo Camino a Villa de Santiago 300","SANTIAGO","NUEVO LEON"," 81 8152 0500",null,"LAURA ENRIQUEZ"]
[57,"LIPSA INDUSTRIAL S.A DE C.V","LOMAS HERMOSA","PRESA TEPUXTEPEC","MIGUEL HIDALGO","CIUDAD DE MEXICO",null,null,"VERACRUZ"]
[401,"LITECRETE SA DE CV","MONTERREY CENTRO","MIGUEL HIDALGO Y COSTILLA","MONTERREY","NUEVO LEON",8119158657,"INTERNO","LAURA ENRIQUEZ"]
[167,"LM TRANSPORTACIONES SA DE CV","EJ. STA FE CHIHU","Autopista Cadereyta - Reynosa KM 36 ","CADEREYTA","NUEVO LEON",8119589590,"FSI1217","INVERMEX"]
[184,"LR TARIMAS Y MADERAS S. DE R.L. DE C.V.","PARQUE INDUSTRIAL MILIMEX",null,"APODACA","NUEVO LEON",null,null,"INVERMEX"]
[182,"LUIS GUILLERMO GUTIERREZ CHAVARRIA","VALLE DE HUINALA",null,"APODACA","NUEVO LEON",null,null,"LUIS CASTILLO"]
[239,"LUP LOGISTICA SA DE CV","PARQUE INDUSTRIAL EL CARMEN",null,"EL CARMEN","NUEVO LEON",null,null,"INVERMEX"]
[null,"MAGDA IMELDA GELACIO SOTO","PRIVADA DEL PARQUE ","ISIDRO SEPULVEDA ","APODACA ","NUEVO LEON",null,24896,"SARAI SOLIS "]
[276,"MAGNEKON, S.A. DE C.V.","TACUBA",null,"SAN NICOLAS DE LOS GARZA","NUEVO LEON",80307000,null,"SARAI SOLIS "]
[288,"MAGOTTEAUX SA DE CV","AV. SAN NICOLAS NORTE","VICTORIA","MONTERREY","NUEVO LEÓN",null,"INTERNO","V3-LAURA ENRIQUEZ"]
[240,"MANTENIMIENTO INTEGRAL FINSA, S.A. DE C.V.","PARQUE INDUSTRIAL FINSA",null,"GUADALUPE","NUEVO LEON",null,null,"LUIS CASTILLO"]
[193,"MANTENIMIENTO Y SERVICIOS INTEGRALES SUSTENTA S.A. de C.V.","MITRAS CENTRO",null,"MONTERREY","NUEVO LEON",null,null,"N/A"]
[174,"MANTTRA-GIMSA, S.A. DE C.V.","GUADALUPE",null,"MONCLOVA","COAHUILA DE ZARAGOZA",null,null,"INVERMEX"]
[58,"MAQUINADOS Y SERVICIOS FAZHER S.A DE C.V","15 DE MAYO","JUAN MENDEZ","MONTERREY","NUEVO LEON",null,null,"INVERMEX"]
[345,"MARIA DEL CARMEN MENDOZA MIRELES","MODERNA","PINO #713","MONTERREY","NUEVO LEON",null,null,"LUIS CASTILLO"]
[59,"MEGA ALIMENTOS S,A DE C.V.",null,"ANTIGUO CAMINO A VILLA DE GARCIA","SANTA CATARINA","NUEVO LEON","81 8048 2600","ADFRME-275/2018","LUIS CASTILLO"]
[60,"MELTER S.A DE C.V","PARQUE INDUSTRIAL ALMACENTRO","C","APODACA","NUEVO LEON",null,null,"INVERMEX"]
[405,"METALIA MS","LAS ENCINAS","OCAMPO","ESCOBEDO","NUEVO LEON",8119094054,"FSI-189-1","LAURA ENRIQUEZ"]
[61,"MISSION FOODS MEXICO S DE R L DE C V","N/E","AV. PROF. HUMBERTO RAMOS LOZANO","APODACA","NUEVO LEON",null,"164/2016","LUIS CASTILLO"]
[263,"MOLINOS AZTECA, SA DE CV","LA PURISIMA","AV. ADOLFO RUIZ CORTINES","GUADALUPE","NUEVO LEON",8115781996,null,"LAURA ENRIQUEZ"]
[417,"MONTAJES INDUSTRIALES PH","VISTA HERMOSA","GARDENIAS LT-3","NICOLAS ROMERO","CDMX",5516602595,null,"LAURA ENRIQUEZ"]
[176,"MRB REST GROUP SA DE CV",null,null,null,"NUEVO LEON",null,null,"INVERMEX"]
[346,"MUELLER COMERCIAL DE MEXICO","INDUSTRIAL LOS PARQUES","CAMINO AL MEZQUITAL","SAN NICOLAS","NUEVO LEON",8182542965,"INTERNO","LUIS CASTILLO"]
[62,"NACIONAL DE ALIMENTOS Y HELADOS S.A. DE C.V.","NORBERTO AGUIRRE","AV. SAN PEDRO  #200","SANTA CATARINA","NUEVO LEON",null,"N/A","LAURA ENRIQUEZ"]
[63,"NAVISTAR MEXICO S DE RL DE CV","PALMAS POLANCO","AV. EJERCITO NACIONAL","CDMX","CIUDAD DE MEXICO",null,null,"SARAI SOLIS "]
[124,"NEMAK MEXICO, S.A",null,"LIBRAMIENTO ARCO VIAL","GARCIA","NUEVO LEON",null,"INTERNO","INVERMEX"]
[383,"NGK CERAMICS MEXICO ","MONTERREY TECHNOLOGY PARK","AVENIDA TECNOLOGICO","CIENEGA DE FLORES","NUEVO LEON ",8182881000,"307/2016","LUIS SOTO-INVERMEX"]
[326,"NITTO DENKO DE MEXICO S DE RL DE CV","PARQUE INDUSTRIAL LA SILLA ","DESARROLLO #100","APODACA","NUEVO LEON",null,"INTERNO","LUIS CASTILLO"]
[214,"NOANIM S.A. DE C.V.","BOSQUES DEL VALLE",null,"SAN PEDRO GARZA GARCIA","NUEVO LEON",null,null,"INVERMEX"]
[384,"NORTH POLE STAR","AMERICAN INDUSTRIES APODACA","AMERICAS #200","APODACA","NUEVO LEON",null,"433-06","LUIS CASTILLO"]
[375,"NOVOCAST","EL CARMEN","CARR MONTERREY-MONCLOVA KM12","EL CARMEN","NUEVO LEON",8110222935,null,"LUIS CASTILLO"]
[64,"OES ENCLOSURES MANUFACTURING MEXICO S DE RL DE CV","SALINAS VICTORIA","CARRETERA SALINAS VICTORIA",null,"NUEVO LEON",null,"DGIA-F5-190","LUIS CASTILLO"]
[207,"OLEOALIMENTOS S.A. DE C.V.","OBRERA",null,"MONTERREY","NUEVO LEON",null,"DGIA-FS-33","LUIS CASTILLO"]
[394,"OMA VYNMSA AERO INDUSTRIAL PARK","VALLE OTE","LAZARO CARDENAS","SAN PEDRO GARZA GARCIA","NUEVO LEON",8126224886,"68/15","LUIS CASTILLO"]
[65,"OMNIBUS DE MEXICO S.A. DE C.V.",null,"REPUBLICA DE PERU","AGUASCALIENTES","AGUASCALIENTES",null,"FW-0255/12/22","INVERMEX"]
[247,"ONE PLUS INDUSTRIAL SOLUTION, SA DE CV","PARQUE INDUSTRIAL EL SABINAL",null,"APODACA","NUEVO LEON",818154600,null,"INVERMEX"]
[66,"OPERADORA DE BOLICHE DE MONTERREY SA DE CV","JARDINES DE ESCOBEDO II","MANUEL L BARRAGAN","MONTERREY","NUEVO LEON",null,null,"LUIS CASTILLO"]
[67,"OPERADORA HOSPITARIA S A P I DE CV","Obispado","HIDALGO","MONTERREY","NUEVO LEON",null,null,"LUIS CASTILLO"]
[130,"OPERADORA MERCO  SAPI DE CV","MONCLOVA CENTRO",null,null,"COAHUILA",null,"DGIA-0927","INVERMEX"]
[224,"OSRAM DE MEXICO, S.A. DE C.V.","SAN ANDRES ATOTO",null,"NAUCALPAN","MEXICO",null,null,"INVERMEX"]
[68,"OVALLE SERVICIOS S.A. DE C.V.","Chapultepec","DEL CARMEN","SAN NICOLAS DE LOS GARZA","NUEVO LEON",null,null,"INVERMEX"]
[354,"PAIPRO CONSTRUCCION Y PAILERIA","SAN RAFAEL","RUIZ CORTINEZ","GUADALUPE","NUEVO LEON",8113639324,null,"LUIS CASTILLO"]
[437,"PANASONIC AUTOMOTIVE SYSTEMS MONTERREY MEXICO","REGIO PARQUE INDUSTRIAL","JULIAN TREVIÑO ELIZONDO","APODACA","NUEVO LEON",null,"TGA-369","LUIS CASTILLO"]
[191,"PAPELES Y CONVERSIONES DE MEXICO, S.A. de C.V.","DIVISION DEL NORTE","CERRO DE LA SILLA #101","GUADALUPE","NUEVO LEON",null,27446,"LAURA ENRIQUEZ"]
[330,"PARKER AMERICAS DE MEXICO","PARQUE INDUSTRIAL LA SILLA ",null,"APODACA","NUEVO LEON",null,null,"LUIS CASTILLO"]
[69,"PARQUE FUNDIDORA",null,"FUNDIDORA Y ADOLFO PRIETO",null,"NUEVO LEON",null,null,"INVERMEX"]
[70,"PAULO RINCON PUENTE","BUROCRATAS DE GUADALUPE","JUSTICIA SOCIAL","JUAREZ","NUEVO LEON",null,null,"INVERMEX"]
[121,"PENSKE TRUCK ARRENDADORA DE MEXICO S.A DE C.V","SAN SEBASTIAN  XHALA","Carretera Monterrey-Colombia Km.6",null,"ESTADO DE MEXICO",8189010500,738,"INVERMEX"]
[71,"PG CKD G F/00972","LOMAS HIPODROMO","AV. DEL CONSCRIPTO","NAUCALPAN DE JUAREZ","ESTADO DE MEXICO",null,null,"INVERMEX"]
[74,"PG CKD P F/00981","Cruz Manca","SANTA FE","CUAJIMALPA DE MORELOS","ESTADO DE MEXICO",null,null,"INVERMEX"]
[325,"PICSI SA DE CV","PRIVADAS DEL PONIENTE","PRIV. SANTA CECILIA #148","SANTA CATARINA","NUEVO LEON",null,"INTERNO","INVERMEX"]
[403,"PINTURAS BEREL","NO ESPECIFICADA","CARRETERA A VILLA DE GARCIA 2551 KM 2.7","SANTA CATARINA","NUEVO LEON",8123746895,"INTERNO","LUIS CASTILLO"]
[347,"PINTURAS DOAL SA DE CV","JARDINES DE SAN RAFAEL","CARR A SAN MIGUEL","GUADALUPE","NUEVO LEON",8181311100,"                                                                                                                                     ","LUIS CASTILLO"]
[282,"PINTURAS OSEL SA DE CV","JOSEFA ZOZAYA SECT 1","AV. ACAPULCO","GUADALUPE","NUEVO LEÓN","81 8131 3333",731,"LAURA ENRIQUEZ"]
[419,"PLATO EXPRESS OPERACIONES","LAS FUENTES SECCION LOMAS","PEKIN",null,"TAMAULIPAS",null,"INTERNO","LAURA ENRIQUEZ"]
[188,"PLAYTIME MONTERREY S.A. DE C.V.","LOS CRISTALES",null,"MONTERREY","NUEVO LEON",null,null,"INVERMEX"]
[75,"PLAZA HUAJUCO UNO SAPI DE CV","Residencial San Agustin 1 Sector","VASCONCELOS","SAN PEDRO GARZA GARCIA","NUEVO LEON",null,null,"INVERMEX"]
[285,"PLESA ANAHUAC Y CIAS S.A DE C.V","SN FRANCISCO CHILPAN",null,"TULTITLAN","MEXICO",8110862080,"INTERNO ","LUIS CASTILLO"]
[111,"POLLOS EXPO GUADALUPE S.A DE C.V","LA HACIENDA","AVENIDA BENITO JUAREZ",null,"NUEVO LEON",8111837281,null,"INVERMEX"]
[195,"PORCELANITE LAMOSA SA DE CV","VALLE OTE","Antigua Carretera Apodaca-B Juarez Km 59.8","SAN PEDRO  GARZA GARCIA","NUEVO LEON","81 8047 4200",null,"LUIS CASTILLO"]
[76,"PORTAFOLIOS DE SOLUCIONES ESTRATÉGICAS INDUSTRIALES S.A DE C.V","HIDALGO","SENDERO DE LOS LIRIOS","MONTERREY","NUEVO LEON",null,null,"INVERMEX"]
[311,"PREFAB SOLUTIONS SA DE CV","LOMAS DE SANTA CATARINA","CARR. FEDERAL MONTERREY SALTILLO #4000","SANTA CATARINA","NUEVO LEÓN",null,"FSI-359","LAURA ENRIQUEZ"]
[244,"PRELOSA PREFABRICADOS, DISEÑO Y CONSTRUCCION, SA DE CV",null,null,"SALINAS VICTORIA","NUEVO LEON",8183851985,null,"LUIS CASTILLO"]
[77,"PRESAJET    S A P I DE C V","SIN COLONIA","CARR. VILLA DE GARCIA KM","GARCIA","NUEVO LEON",null,"FSI-266","INVERMEX"]
[264,"PRIMETALS TECHNOLOGIES MEXICO, S DE RL DE CV","PARQUE INDUSTRIAL MILIMEX",null,"APODACA","NUEVO LEON",8181960909,null,"INVERMEX"]
[78,"PRODUCTORA DE BOCADOS CARNICOS SA DE CV","BUENOS AIRES","AVENIDA DEL ESTADO","MONTERREY","NUEVO LEON",null,"DGIA-FS-17","INVERMEX"]
[304,"PRODUCTORA DE PAPEL","SIN NOMBRE","VIA FERROCARRIL A MATAMOROS  KM. 7","SAN NICOLAS DE LOS GARZA","NUEVO LEON",null,"INTERNO","SARAI SOLIS "]
[256,"PRODUCTORA DE TARIMAS DEL SUR, SA DE CV","SAN MARTIN OBISPO",null,"TEPETLIXPA","MEXICO",8183444399,null,"LUIS CASTILLO"]
[159,"PRODUCTOS AGROINDUSTRIALES AZTECA SA DE CV","DEL VALLE",null,"SAN PEDRO","NUEVO LEON",null,"27,080-1","LAURA ENRIQUEZ"]
[79,"PRODUCTOS LAMINADOS DE MONTERREY S.A. DE C.V.","CERCA ENTRONQUE","CARR A COLOMBIA","GENERAL ESCOBEDO","NEUVO LEON",null,null,"INVERMEX"]
[80,"PROMAQUINA S.A DE C.V.",null,"CARRETERA A MONTERREY Y CD. MIER","CERRALVO","NUEVO LEON",null,null,"INVERMEX"]
[81,"PROMOTORA DE MADERAS MONTERREY S.A DE C.V","EL SABINO","AV.BENITO JUAREZ",null,"NUEVO LEON",null,null,"INVERMEX"]
[266,"PROTEINAS NATURALES","Mitras Nte.,","Av. Dr. José Eleuterio González 2815","MONTERREY","NUEVO LEON"," 81 8389 7500","199/016","LUIS CASTILLO"]
[421,"PROTEXA RECUBRIMIENTOS","FRACC INDUSTRIAL TIZAYUCA","EJE ORIENTE PONIENTE","TIZAYUCA","HIDALGO",null,null,"LAURA ENRIQUEZ"]
[237,"PROVEEDORES DE INGENIERIA ALIMENTARIA S.A. DE C.V.","FRACC. PIMSA OTE",null,"APODACA","NUEVO LEON",null,"525/2019","INVERMEX"]
[82,"PYOSA INDUSTRIAS S A P I DE CV","BELLA VISTA","AV INDUSTRIAS","MONTERREY","NUEVO LEON",null,null,"LUIS CASTILLO"]
[149,"QUALTIA ALIMENTOS COMERCIALES S DE RL DE CV","LA GRANGE","Av Conductores 600","SAN NICOLAS DE LOS GARZA","NUEVO LEON","81 8030 3000",null,"LUIS CASTILLO"]
[146,"QUIMICA APOLLO SA DE CV","EX PORTEC II",null,"TOLUCA DE LERDO","TOLUCA",null,null,"INVERMEX"]
[83,"QUIMICOS Y PAPELES DEL NORTE S.A. DE C.V.","DEL NORTE","AV. SAN NICOLAS","MONTERREY","NUEVO LEON",null,null,"INVERMEX"]
[386,"QUIMOBASICOS SA DE CV","PEDRO LOZANO","RUIZ CORTINEZ","MONTERREY","NUEVO LEON",8182534103,"INTERNO","LUIS CASTILLO"]
[265,"RAUL GARZA ESTRELLA",null,null,"SAN NICOLAS","NUEVO LEON",8181408870,null,"INVERMEX"]
[298,"RECICLADORA INDUSTRIAL DE ACUMULADORES","CARRETERA A GARCIA KM 1.2",null,"SANTA CATARINA","Nuevo León",null,"PTAR-122","LAURA ENRIQUEZ"]
[392,"RECICLAJES GAP SA DE CV","RESIDENCIAL SANTA BARBARA","SAN JOSE","SAN PEDRO GARZA GARCIA","NUEVO LEON",8118230331,"INTERNO","LUIS CASTILLO"]
[218,"RECICLAJES Y DESTILADOS MONTERREY, S.A. de C.V.","PARQUE INDUSTRIAL ARCO VIAL",null,"GARCIA","NUEVO LEON",8183810636,"INTERNO","LUIS CASTILLO"]
[84,"RECOLECCIONES ECOLOGICAS INDUSTRIALES DE MEXICO SA DE CV",null,"CERRO DEL AGUILA","GENERAL ESCOBEDO","NUEVO LEON",null,null,"N/A"]
[126,"RED AMBIENTAL CIPRES",null,"AV DE LOS MAGUEYES S/N","SALINAS VICTORIA     C.P 65500","NUEVO LEON",8124136685,"DGIA-F5-77","LAURA ENRIQUEZ"]
[85,"RED RECOLECTOR, SA DE CV","PUERTO DE DURAZNO","ADOLFO LOPEZ MATEOS",null,"NUEVO LEON",8181505959,"DGIA-FS-77","V3-LAURA"]
[316,"REFORESTACION EXTREMA ","SANTA ENGRACIA","AV. RICARDO MARGAIN #575","SAN PEDRO GARZA GARCIA","NUEVO LEON",818007909,"N/A","SARAI SOLIS "]
[388,"REGIOMONTANA DE PERFILES Y TUBOS","PARQUE INDUSTRIAL MONTERREY","CALLE PRIMERA PONIENTE","APODACA","NUEVO LEON",8181565555,null,"SARAI SOLIS "]
[null,"REIT PROPIEDADES INDUSTRIALES","FRACC. SANTA CATARINA INDUSTRIAL PARK","CARR. A VILLA DE GARCIA","SANTA CATARINA","NUEVO LEON",null,"534-9","LUIS CASTILLO"]
[86,"RELEVANCIA MOTRIZ S.A DE C.V","CASA BELLA","AV. SENDERO DIVISORIO","SAN NICOLAS DE LOS GARZA","NUEVO LEON",null,"DGIA-FS-45","LUIS CASTILLO"]
[null,"REMARE RECOLECCION Y MANEJO DE RESIDUOS","CARLOS SALINAS DE GORTARI KM 10.8",null,"APODACA","NUEVO LEON",null,"160/07","LUIS CASTILLO"]
[148,"RESTAURANT BAR LOS AGAVES SA DE CV","RIBERAS DE LA PURISIMA",null,"GUADALUPE","NUEVO LEON",null,null,"INVERMEX"]
[108,"RESTAURANTE  PUNTO ROJO S.A DE C.V","LINDA VISTA","MIGUEL ALEMAN","GUADALUPE","NUEVO LEON",8184795359,null,"INVERMEX"]
[410,"RICARDO SAMUEL PALOMARES GOMEZ","VALLE DE CUMBRES","MONTE SINAI","GARCIA","NUEVO LEON",8115853297,"INTERNO","LAURA ENRIQUEZ"]
[183,"ROCA BATHROOM  PRODUCTS MEXICO S.A. DE C.V. ","TORRES DE SANTO DOMINGO","AV. LAGRANGE","SAN NICOLAS DE LOS GARZA","NUEVO LEON",null,"INTERNO","LUIS CASTILLO"]
[87,"ROT QUMICA S.A DE C.V",null,"CARRETERA MONTERREY MONCLOVA KM 14","EL CARMEN","NUEVO LEON",null,null,"LUIS CASTILLO"]
[88,"RYDER CAPITAL ","CIENEGA DE FLORES",null,null,null,null,"FSI-295","LAURA ENRIQUEZ"]
[88,"RYDER CAPITAL S. DE R.L. DE C.V.","CENTRO DE CIUDAD SANTA FE","AV. VASCO DE QUIROGA","ALVARO OBREGON","CIUDAD DE MEXICO",null,"FSI-295","LAURA ENRIQUEZ"]
[89,"SANDRA CAROLINA MARTINEZ RODRIGUEZ","FRACC. BERNARDO REYES","LAGO DE CHAPALA","MONTERREY","NUEVO LEON",8116610150,null,"INVERMEX"]
[335,"SANIVAC DEL NORTE SA DE CV","SANTA FE","VIA A TAMPICO #1031 F","MONTERREY","NUEVO LEON",null,"INTERNO","INVERMEX"]
[415,"SBQ DISTRIBUCION","INDUSTRIAL NIÑOS HEROES","AGUSTIN MELGAR","TLALNEPANTLA DE BAZ","MEXICO",8111623120,null,"LUIS CASTILLO"]
[359,"SEIF Y RESPUESTA A EMERGENCIAS","20 DE NOVIEMBRE","ROMAN MARIN 2705","COATZACOALCOS","VERACRUZ",4447051557,null,"LUIS CASTILLO"]
[408,"SEJONG MEXICO",null,"CARRETERIA PESQUERIA-LOS RAMONES","PESQUERIA","NUEVO LEON",8159987820,"DGIA-FS-45","LUIS CASTILLO"]
[90,"SEMARNAT-CONAGUA ORGANISMO DE CUENCA RIO BRAVO","FIERRO","AV. CONSTITUCION","MONTERREY","NUEVO LEON",null,null,"N/A"]
[366,"SERVI TRANSPORTES VIGA","VILLA SAN MIGUEL","CARR SAN MIGUEL KM2","GUADALUPE","NUEVO LEON",8181314600,"FSI-162","SARAI SOLIS "]
[307,"SERVICIOS AMBIENTALES INTERNACIONALES ","APODACA CENTRO","CARRETERA LIBRE A HUINALA MEZQUITAL  #120","APODACA","NUEVO LEON",null,"INTERNO","LUIS CASTILLO"]
[91,"SERVICIOS DE AGUA Y DRENAJE DE MONTERREY, I. P. D.","OBISPADO","MATAMOROS PONIENTE","MONTERREY","NUEVO LEON",null,null,"N/A"]
[92,"SERVICIOS DE EQUIPAMIENTO Y OPERACION HOSPITALARIA SA DE CV","HEROES DE PADIERNA","CAMINO A SANTA TERESA","LA MAGDALENA CONTRERAS","CIUDAD DE MEXICO",null,null,"N/A"]
[202,"SERVICIOS INDUSTRIALES KARMET SA DE CV","BETEL",null,"SAN NICOLAS DE LOS GARZA","NUEVO LEON",null,null,"INVERMEX"]
[341,"SERVICIOS INDUSTRIALES RINGON SA DE CV","LOS FRESNOS II","DEL OLIVO 417","APODACA","NUEVO LEON",8181696260,null,"INVERMEX"]
[396,"SERVICIOS INDUSTRIALES TRESVAZ SA DE CV","BOSQUES DE LA PASTORA","BOSQUES DE LA HUASTECA","GUADALUPE","NUEVO LEON",8125681831,null,"SARAI SOLIS "]
[93,"SERVICIOS Y TRANSPORTES GUERRA S.A. DE C.V","CENTRAL DE CARGA","TRES","GUADALUPE","NUEVO LEON",null,null,"INVERMEX"]
[123,"SERVYGRU ALLROADS S DE RL DE C.V","PASO REAL","José Moreno 808",null,"DURANGO"," 81 8007 8408",null,"LUIS CASTILLO"]
[94,"SETRAMEX TRANSPORTES S.A. DE C.V.","SANTA BARBARA","CARRETERA TORREON SAN PEDRO",null,"COHUILA",null,null,"LUIS CASTILLO"]
[404,"SHINSUNG AUTOMOTRIZ MEXICANA S DE RL DE CV","PARQUE INDUSTRIAL EL SABINAL","EL SABINAL","APODACA","NUEVO LEON",8121035502,null,"SARAI SOLIS "]
[95,"SIGMA ALIMENTOS CONGELADOS S.A DE C.V","PARQUE INDUSTRIAL","AV. INDUSTRIA ALIMENTICIA","LINARES","NUEVO LEON",null,null,"LUIS CASTILLO"]
[433,"SIGMA ALIMENTOS LACTEOS",null,"CAMINO A FERTIMEX 666","LAGOS DE MORENO","JALISCO",null,"PMRME-1120/2023 A","ALEJANDRA ALONSO"]
[235,"SIKPRO MIT MAURER S.A. DE C.V.","ARCOS DEL ALBA",null,"CUAUTITLAN IZCALLI","MEXICO",null,null,"LUIS CASTILLO"]
[371,"SISFLEX","UNION L AGRO","RAUL SOLIS 201","ESCOBEDO","NUEVO LEON",8182990243,"FI-418","LAURA ENRIQUEZ"]
[360,"SISTEMA AMBIENTAL INDUSTRIAL","DEL PRADO","GENERAL PEDRO MARIA ANAYA #161","MONTERREY","NUEVO LEON",null,"ADFRME-217/2018","INVERMEX"]
[null,"SISTEMA INTEGRAL PARA EL MANEJO ECOLOGICO Y PROCESAMIENTO DE DESECH","CENTRO","EMILIO CARRANZA SUR","MONTERREY","NUEVO LEON",null,"FI-509","LAURA ENRIQUEZ"]
[170,"SISTEMA MUNICIPAL DE AGUAS Y SANEAMIENTO DE CASTAÑOS COAHUILA","ZONA CENTRO",null,null,"COAHUILA",null,null,"INVERMEX"]
[109,"SISTEMAS HORMIGA S.A DE C.V.",null,"CARRETERA MONTERREY -LAREDO",null,"NUEVO LEON",8181900363,"FSI-2101","INVERMEX"]
[118,"SMURFIT CARTON Y PAPEL DE MEXICO S.A DE C.V.","GRANADA",null,"MIGUEL HIDALGO","CIUDAD DE MEXICO",null,null,"INVERMEX"]
[102,"SOCIEDAD MEXICANA DE PARRILLEROS SMP S.A DE C.V","MONTERREY CENTRO","ISAAC GARZA PTE","MONTERREY","NUEVO LEON",null,null,"INVERMEX"]
[113,"SOCIEDAD MEXICANA DE PROMOCION, SA DE CV","SAN FRANCISCO CHILPAN","AV. VALLE DE LAS ALAMEDAS","TULTITLAN","ESTADO DE MEXICO","1086-2080",null,"LUIS CASTILLO"]
[158,"SOLUCIONES EN DISTRIBUCION DE MERCANCIA S DE RL DE CV","CENTRAL DE CARGA",null,"GUADALUPE","NUEVO LEON",null,null,"INVERMEX"]
[145,"SOLUCIONES HIDRAULICAS VAEL SA DE CV","BOSQUES DE SATELITE",null,"MONTERREY","NUEVO LEON",null,null,"INVERMEX"]
[420,"SOLUCIONES POP","PROGRESO","LUIS QUINTANAR","MONTERREY","NUEVO LEON",8183338060,null,"OMAR MORENO"]
[179,"SOLUCIONES Y TRATAMIENTO ECOLOGICO SAPI DE CV",null,null,"MIGUEL HIDALGO","CDMX",null,null,"INVERMEX"]
[222,"SPRAYLAB, S.A. DE C.V.","Parque Industrial la Puerta"," Av. Las Torres 1533-a-3","Santa Catarina","NUEVO LEON"," 81 8218 0689",null,"LUIS CASTILLO"]
[177,"SSNL SERVICIOS SUSTENTABLES NL(BIONERGIA)","CENTRO","Carretera Colombia Kilómetro 10.5","MONTERREY","NUEVO LEON",8182390202,897,"INVERMEX"]
[334,"STANDARD REGISTER LATINOAMERICA S DE RL DE CV","PARQUE INDUSTRIAL LAS AMERICAS","CARR. A HUINALA K.M 2.8  #404 A ","APODACA","NUEVO LEON ",null,"251/2016","SARAI SOLIS "]
[97,"STEEL BREEZE TECH SA DE CV",null,"CARRETERA A COLOMBIA",null,"NUEVO LEON",null,"FSI-221","INVERMEX"]
[null,"STUCKI DE MEXICO","COYOACAN","AV.LOS ANDES 200"," ","NUEVO LEON",null,null,"LUIS CASTILLO"]
[377,"SUCABRITO","CENTRO","AUTOPISTA MTY-CADEREYTA","CADEREYTA","NUEVO LEON",8116361321,"FSI-178","INVERMEX"]
[373,"SUCROLIQ","BOSQUES DE LAS LOMAS","PASEO DE LOS TAMARINDOS","CUAJIMALPA DE MORELOS","CIUDAD DE MEXICO",8112059942,"INTERNO","LUIS CASTILLO"]
[331,"SUPER TRANSPORTE INTERNACIONAL SA DE CV","EJIDO SAN FRANCISCO","CARR. A PIEDRAS NEGRAS KM 17 + 777.35","NUEVO LAREDO","TAMAULIPAS",null,"FSI-356","INVERMEX"]
[340,"SYMRISE S DE RL DE CV","GARZA CANTU","REPUBLICA MEXICANA","SAN NICOLAS DE LOS GARZA","NUEVO LEON",8183296745,null,"LUIS CASTILLO"]
[273,"TAE SUNG MEXICO S.A. DE C.V.","PARQUE INDUSTRIAL MONTERREY",null,"APODACA","NUEVO LEON",null,null,"INVERMEX"]
[216,"TAMALES SALINAS DE JUAREZ NL S.A. DE C.V.",null,null,"BENITO JUAREZ","NUEVO LEON",null,null,"INVERMEX"]
[null,"TAURO REMOLQUES","NO ESPECIFICADA","CARRETERA A LAREDO KM 26","CIENEGA DE FLORES","NUEVO LEON",null,"F1-516","INVERMEX"]
[164,"TECHNOCAST SA DE CV",null,null,"RAMOS ARIZPE","COAHUILA",null,null,"INVERMEX"]
[252,"TECNIQUIMIA  MEXICANA, SA DE CV","PARQUE INDUSTRIAL MITRAS","Beta 8023","GARCIA","NUEVO LEON","81 8158 7100","FSI-246","LUIS CASTILLO"]
[139,"TECNO MAIZ S.A DE C.V.","LA PURISIMA","Adolfo Ruiz Cortines Pte",null,"NUEVO LEON",null,"172/2014","LAURA ENRIQUEZ"]
[339,"TECNOLOGIA AMBIENTAL ESPECIALIZADA SA DE CV","NO ESPECIFICADA","CARRETERA 57 BLVD GUSTAVO GALAZ KM 182","CASTAÑOS","COAHUILA",null,null,"LUIS CASTILLO"]
[178,"TEKSID HIERRO DE MEXICO S.A. DE C.V.",null,null,"FRONTERA","COAHUILA",null,null,"INVERMEX"]
[409,"TEREX GENIE MEXICO","BUSINEES PARK MONTERREY","CARR MIGUEL ALEMAN","APODACA","NUEVO LEON",8125688391,"FSI-228","SARA SOLIS"]
[98,"TERMOLITA S A P I DE C V","ZONA INDUSTRIAL","CALLEJON DEL MARMOL","SANTA CATARINA","NUEVO LEON",null,null,"INVERMEX"]
[268,"TEYAR","BARRIO DE LA CONCEPCION",null,"SAN MATEO ATENCO","MEXICO",null,null,"INVERMEX"]
[null,"TISAL 4850","NORTE","AV LOS ANGELES 2210","MONTERREY","NUEVO LEON",null,null,"LUIS CASTILLO"]
[249,"TOSTADAS Y BOTANAS PREMIUM, SA DE CV","REGIO PARQUE INDUSTRIAL",null,"APODACA","NUEVO LEON",null,"28/305","INVERMEX"]
[283,"TOTO MEXICO S.A DE C.V","PARQUE INDUSTRIAL MULTIPARQUE","AV. TOTO 1100","CIENEGA DE FLORES","NUEVO LEON",8182882600,"713/2009","LUIS CASTILLO"]
[198,"TR INSUMOS S.A. DE C.V.","PARQUE INDUSTRIAL MG",null,"CIENEGA DE FLORES","NUEVO LEON",null,"FSI-386","INVERMEX"]
[99,"TRACK2SHELF DE MEXICO S.A DE C.V","SANTA ENGRACIA","RICARDO MARGAIN ZOZAYA","SAN PEDRO GARZA GARCIA","NUEVO LEON",null,115173,"INVERMEX"]
[254,"TRACTOCAMIONES KENWORTH DE MONTERREY, SA DE CV","CENTRO",null,"APODACA","NUEVO LEON",null,null,"INVERMEX"]
[413,"TRANS-ENERGETICOS","CENTRO","LIBRAMIENTO MARTINEZ DOMINGUEZ KM 0.5","CADEREYTA","NUEVO LEON",null,"19-ASEA-GRP-13857-2024","LAURA ENRIQUEZ"]
[348,"TRANSMINERALES ZARFER","REFORMA","CALLE 4TA VIDRIERA OTE 1629","MONTERREY","NUEVO LEON",8134054977,"FSI-303","SARAI SOLIS "]
[219,"TRANSPORTES CASTORES DE BAJA CALIFORNIA S.A. DE C.V.","ALFARO",null,null,"GUANAJUATO",null,null,"LUIS CASTILLO"]
[180,"TRANSPORTES CUAUHTEMOC, S.A. DE C.V.","PARQUE INDUSTRIAL STIVA AEROPUERTO","TRATADO DE LIBRE COMERCIO","APODACA","NUEVO LEON",null,null,"INVERMEX"]
[233,"TRANSPORTES DE CARGA FEMA S.A. DE C.V.","LA CONCORDIA",null,null,"TAMAULIPAS",null,null,"LUIS CASTILLO"]
[161,"TRANSPORTES INTERNACIONALES ALCOSA SA DE CV","SATELITE ACUEDUCTO",null,"MONTERREY","NUEVO LEON",null,null,"INVERMEX"]
[181,"TRANSPORTES JULIAN OBREGON S.A. DE C.V.",null,null,"LEON","GUANAJUATO",null,null,"LUIS CASTILLO"]
[100,"TRANSPORTES LOGISTICOS ESPECIALIZADOS S.A. DE C.V.","CERRO AZUL","CARRETERA A REYNOSA","GUADALUPE","CERRO AZUL",null,null,"INVERMEX"]
[270,"TRANSPORTES MIGMAR","CENTRAL DE CARGA",null,"SAN NICOLAS DE LOS GARZA","NUEVO LEON",null,null,"INVERMEX"]
[381,"TRANSPORTES MINERVA ","CENTRAL DE CARGA","AV. BONIFACIO SALINAS LEAL #615","GUADALUPE","NUEVO LEON",8110155824,"INTERNO","INVERMEX"]
[393,"TRITURADOS INDUSTRIALES MONTERREY",null,"CAMINO A LAS PEDRERAS KM 7.5","ESCOBEDO","NUEVO LEON",8129117161,"069/06","LAURA ENRIQUEZ"]
[null,"TUOPU GROUP MEXICO",null,"TEXAS","CIENEGA DE FLORES","NUEVO LEON",null,null,"LAURA ENRIQUEZ"]
[132,"TUPY  MEXICO SALTILLO S.A DE C.V",null,null,null,"COAHUILA",null,"FSI 190","INVERMEX"]
[null,"UNIVERSIDAD DE MONTERREY","LA ESTANZUELA","PRIVADA SAN ANGEL S/N","MONTERREY","NUEVO LEON",null,"FSI-240","LAURA ENRIQUEZ"]
[369,"VACUUM SYSTEMS","LAS PALMAS","EMPRESARIOS","SANTA CATARINA","NUEVO LEON",null,"INTERNO","SARAI SOLIS "]
[267,"VALLE ALTO AC","LA ESTANZUELA",null,null,null,8181558400,"FSI-283","LUIS CASTILLO"]
[103,"VALVULAS DE CALIDAD DE MONTERREY S.A DE C.V.","LOMAS DE SANTA CATARINA","CARRETERA MONTERREY-SALTILLO","SANTA CATARINA","NUEVO LEON",8183353569,"027/2011","LAURA ENRIQUEZ"]
[null,"VCD CONSTRUCCIÓN Y DESARROLLO ","SAN JERONIMO","BLVD. ANTONIO L. RODRIGUEZ","MONTERREY","NUEVO LEON",null,"INTERNO","LUIS CASTILLO"]
[null,"VENANPRI TOOLS MONTERREY","GENERAL ESCOBEDO CENTRO","AVENIDA DESARROLLOS #225","GENERAL ESCOBEDO","NUEVO LEON",null,"INTERNO","LUIS CASTILLO"]
[308,"VERNELL INDUSTRIES","PARQUE INDUSTRIAL","INDUSTRIA ALIMENTARIA #2020","LINARES","NUEVO LEON",null,"INTERNO","LUIS CASTILLO"]
[286,"VIABUS SA DE CV","EJIDO LAZARO CARDENAS",null,"SALINAS VICTORIA","NUEVO LEÓN",8182737699,"019/2008","SARAI SOLIS "]
[271,"VIAKEM, S.A DE C.V.","TABACHINES","MANUEL L BARRAGAN #701","SAN NICOLAS DE LOS GARZA","NUEVO LEON",null,"INTERNO","INVERMEX"]
[140,"VITRO AUTOMOTRIZ  S.A DE C.V.",null,null,"NUEVO LEON","GARCIA",null,null,"INVERMEX"]
[147,"VITRO S.A.B. DE C.V.","DEL PRADO",null,"MONTERREY","NUEVO LEON",null,null,"INVERMEX"]
[134,"VOPAK MEXICO, S.A DE C.V.","FRACC.  INDUSTRIAL SAN JUAN DE ULUA",null,null,"VERACRUZ",null,null,"VERACRUZ"]
[null,"WALTON 3 FIDEICOMISO INDUSTRIAL WV I CIB/3676  ","LOMAS DE SAN MARTIN","INOVACION 200","APODACA","NUEVO LEON",null,"FI-480","LUIS CASTILLO"]
[null,"WALTON 3 FIDEICOMISO INDUSTRIAL WV II CIB/3887","VYNMSA SANTA CATARINA INDUSTRIAL PARK II","LIBRAMIENTO NORESTE DE MONTERREY","SANTA CATARINA","NUEVO LEON",null,"FI-512","LUIS CASTILLO"]
[192,"YORTE S.A. de C.V.","BUENOS AIRES",null,"MONTERREY","NUEVO LEON",null,null,"INVERMEX"]
[185,"ZINC NACIONAL","MONTERREY CENTRO","SERAFIN PEÑA SUR","MONTERREY","NUEVO LEON",null,"ADFRME-309/2019","INVERMEX"]
[447,"ENCON MONTERREY","LOMAS DE CHAPULTEPEC I SECCION","MONTES URALES 540","MIGUEL HIDALGO","CDMX",null,null,"LUIS CASTILLO"]