{"text_format":"1","workbook":"xlsx","n_sheets":3,"sheets":["MANIFIESTO ","Hoja1","INFORMACION DE CLIENTES"],"not_rendered":{"charts":0,"images":2,"macros":1,"external_links":0,"defined_names":2,"comments":0,"pivot_tables":0},"unopened":[],"bounds":{"document_bytes":16777216,"sheet_cells":100000,"rows_first":2000,"rows_last":500,"rows_between":2000,"halvings":0,"cell_chars":16384,"cell_head_chars":4096},"cells_cut":0,"cells_raw":0,"read":"whole","date_system":"1900"}

{"sheet":"MANIFIESTO ","index":0,"n_rows":60,"n_cols":15,"rows_kept":60,"cut":false,"hidden":false,"merged":[[39,10,39,11],[28,0,28,1],[30,2,30,3],[24,0,24,7],[7,0,7,7],[30,4,30,5],[30,6,30,7],[41,0,41,7],[17,0,20,7],[16,0,16,7],[11,5,11,6],[8,1,8,6],[15,1,15,3],[26,5,26,6],[36,2,36,3],[32,0,32,7],[35,0,35,7],[33,0,33,7],[34,0,34,7],[30,0,30,1]]}
[]
[null,null,null,null,null,null,"FOLIO:",27102]
[]
[null,null,null,null,"MANIFIESTO PARA EL CONTROL",null,null,null,null,null,null,null,null,null,1145]
[null,null,null,null,"DE DESECHOS NO PELIGROSOS"]
[null,null,null,null,"Y LIMPIEZA DE DRENAJES",null,null,null,null,null,"                                                                                                                                                                                                                                                                                                                                                                                                                                                                                                                                                                                                                                                                                                                                                                                                                                                                                                                                                                                                                                                                                                                                                                                                                                                                                                                                                                                                                                                                                                                                                                                                                                                                                                                                                                                                                                                                                                                                                                                                                                                                                                                                                                                                                                                                                                                                                                                                                                                                                                                                                                                                                                                                                                                                                                                                                                                                                                                                                                                                                                                                                                                                                                                                                                                                                                                                                                                                                                                                                                                                                                                                                                                                                                                                                                                                                                                                                                                                                                                                                                                                                                                                                                                                                                                                                                                                                                                                                                                                                                                                                                                                                                                                                                                                                                                                                                                                                                                                                                                                                                                                                                                                                                                                                                                                                                                                                                                                                                                                                                                                                                                                                                                                                                                                                                                                                                                                                                                                                                                                                                                                                                                                                                                                                                                                                                                                                                                                                                                                                                                                                                                                                                                                                                                                                                                                                                                                                                                                                                                                                                                                                                                                                                                                                                                                                                                                                                                                                                                                                                                                                                                                                                                                                                                                                                                                                                                                                                                                                                                                                                                                                                                                                                                                                                                                                                                                                                                                                                                                                                                                                                                                                                                                                                                                                                                                                                                                                                                                                                                                                                                                                                                                                                                                                                                                                                                                                                                                                                                                                                                                                                                                                                                                                                                                                                                                                                                                                                                                                                                                                                                                                                                                                                                                                                                                                                                                                                                                                                                                                                                                                                                                                                                                                                        "]
[]
["CLIENTE"]
["RAZON SOCIAL:","METALIA MS"]
["LUGAR DE SERVICIO:"]
[]
["DOMICILIO FISCAL  ",null,null,null,"TELEFONO:",{"$f":"VLOOKUP(B9,'INFORMACION DE CLIENTES'!B2:G413,6,0)","v":8119094054}]
["CALLE :",{"$f":"VLOOKUP(B9,'INFORMACION DE CLIENTES'!B:D,3,0)","v":"OCAMPO"},null,null,"ESTADO:",{"$f":"VLOOKUP(B9,Tabla1[[NOMBRE]:[ESTADO]],5,0)","v":"NUEVO LEON"}]
["COLONIA :",{"$f":"VLOOKUP('MANIFIESTO '!B9:G9,Tabla1[[NOMBRE]:[COLONIA]],2,0)","v":"LAS ENCINAS"},null,null,"FOLIO ECOLOGIA:   ",{"$f":"VLOOKUP(B9,Tabla1[[NOMBRE]:[No. ECOLOGIA]],7,0)","v":"FSI-189-1"}]
["MUNICIPIO:",{"$f":"VLOOKUP(B9,Tabla1[[NOMBRE]:[MUNICIPIO]],4,0)","v":"ESCOBEDO"},null,null,"ASESOR COMERCIAL:",{"$f":"VLOOKUP(B9,Tabla1[[NOMBRE]:[ASESOR COMERCIAL ]],8,0)","v":"LAURA ENRIQUEZ"},null,null," "]
[]
["NOTA IMPORTANTE"]
["DECLARO BAJO PROTESTA DE DECIR VERDAD QUE LOS RESIDUOS ENTREGADOS AL TRANSPORTISTA \"CONSTRUCTORA INVERMEX SA DE CV\"  SON DE ORIGEN NO PELIGROSO, MISMOS QUE CUMPLEN CON LOS PARAMETROS QUE LAS AUTORIDADES AMBIENTALES HAN SOLICITADO, DE NO SER ASI EL CLIENTE SE HACE RESPONSABLE DE LAS SANCIONES QUE CORRESPONDAN SEGUN LAS LEYES Y REGLAMENTOS APLICABLES.",null,null,null,null,null,null,null,"."," "]
[]
[]
[]
["RESPONSABLE:",null,null,null,"FIRMA:",null,null,null,null,null,null,"  "]
["PUESTO:",null,null,null,"HORA DE SALIDA:"]
[]
["TRANSPORTISTA"]
[]
["GUZZLER","PIPA",null,"HIDRO","RP","VACTOR"]
[]
["# ECONOMICO:",null,null,"PLACAS:"]
[]
["DESCRIPCION DE RESIDUO",null,"CANTIDAD A DESCARGAR",null,"UNIDAD-VOLUMEN-PESO",null,"PRESENTACION(ESPECIFICA)"]
[]
["DESCRIPCIÓN DEL TRABAJO"]
[]
[]
[]
["NOMBRE OPERADOR:",null,null,null,"FIRMA:"]
["AYUDANTE(S):"]
["FECHA DE SERVICIO:"]
["HORA INICIO:",null,null,"HORA FINAL:",null,"TOTAL HRS:"]
[]
["DESTINO FINAL"]
[]
[]
["RESPONSABLE:",null,null,null,"FIRMA:"]
["(81)9688.7618",null,"ventas@ecoseptic.mx",null,null,"www.ecoseptic.mx"]
["Ave.A #710 y Ave.3, Central de Carga,Guadalupe N.l CP 67129",null,null,null,null,"CONSTRUCTORA INVERMEX S.A DE C.V."]
[]
[]
[]
[]
[]
[]
[]
[]
[]
[]
[]
[]
[null,null,null,null,null,null,null,null,null,null,0]
{"$rows_left_out":1}
{"sheet":"Hoja1","index":1,"n_rows":45,"n_cols":15,"rows_kept":45,"cut":false,"hidden":true,"merged":[[43,13,43,14],[7,1,7,6],[10,5,10,6],[10,13,10,14],[13,9,13,14],[14,1,14,3]]}
[null,null,null,null,null,null,null,null,null,null,"Constructora Invermex S.A de C.V.",null,null,"Orden de trabajo","  "]
[null,null,"|",null,null,null,"FOLIO ",14487,null,null,"Ave. A  # 710 y Ave. 3 Central de carga"]
[null,null,null,null,null,null,null,null,null,null,"Guadalupe, Nuevo Leon"]
[null,null,null,null,"MANIFIESTO PARA EL CONTROL",null,null,null,null,null,"C.P.67129",null,null,"FOLIO: ",14243]
[null,null,null,null,"DE DESECHOS NO PELIGROSOS"]
[null,null,null,null,"Y LIMPIEZA DE DRENAJES"]
[null,null,null,null,null,null,null,null,"NOMBRE:    ",{"$f":"B8","v":"PENSKE TRUCK ARRENDADORA DE MEXICO S.A DE C.V"}]
["CLIENTE:","PENSKE TRUCK ARRENDADORA DE MEXICO S.A DE C.V",null,null,null,null,null,null,"Departamento:"]
["LUGAR DE SERVICIO:",null,null,null,null,null,null,null,"Nombre de quien solicita:"]
[null,null,null,null,null,null,null,null,"Cargo:"]
["DOMICILIO FISCAL  ",null,null,null,"TELEFONO:",{"$f":"VLOOKUP(B8,'INFORMACION DE CLIENTES'!B2:G413,6,0)","v":8189010500},null,null,"fecha de la Solicitud:",null,null,null,null,"FIRMA"]
["CALLE :",{"$f":"VLOOKUP(B8,Tabla1[[NOMBRE]:[ASESOR COMERCIAL ]],3,0)","v":"Carretera Monterrey-Colombia Km.6"},null,null,"ESTADO:","NUEVO LEÓN"]
["COLONIA :",{"$f":"VLOOKUP(B8,Tabla1[[NOMBRE]:[ASESOR COMERCIAL ]],2,0)","v":"SAN SEBASTIAN  XHALA"},null,null,"FOLIO ECOLOGIA:   ",{"$f":"VLOOKUP(B8,Tabla1[[NOMBRE]:[No. ECOLOGIA]],7,0)","v":738}]
["MUNICIPIO:",{"$f":"VLOOKUP(B8,Tabla1[[NOMBRE]:[ASESOR COMERCIAL ]],4,0)","v":0},null,null,"ASESOR COMERCIAL:",{"$f":"VLOOKUP(B8,Tabla1[[NOMBRE]:[ASESOR COMERCIAL ]],8,0)","v":"INVERMEX"},null,null,"PARTIDA","DESCRIPCION DEL TRABAJO"]
[]
[]
["GUZZLER",null,"PIPA",null,"HIDRO",null,"VACTOR"]
["SERVICIO DE LIMPIEZA DE FOSAS SEPTICAS"]
[]
["DESCRIPCION DE RESIDUO",null,"CANTIDAD TOTAL ",null,"UNIDAD-VOLUMEN-PESO",null,"PRESENTACION(ESPECIFICA)"]
[]
[]
["            NOTA IMPORTANTE: BAJO PROTESTA DECIR VERDAD CERTIFICAMOS QUE LOS DESECHOS NO PELIGROSOS"]
["              QUE SE ENTREGAN A LA COMPAÑÍA INVERMEX SA DE CV CUMPLEN CON LOS PARAMETROS QUE",null,null,null,null,null,null,null,null,null,null,null," "]
["                 LAS AUTORIDADES AMBIENTALES HAN SOLICITADO DE NO SER ASI NOS HACEMOS ACREEDORES A LAS"]
["                           SANCIONES QUE CORRESPONDAN SEGUN LAS LEYES Y REGLAMENTOS APLICABLES "]
[]
["RESPONSABLE:",null,null,null,"FIRMA:"]
["PUESTO:",null,null,null,"HORA DE SALIDA:"]
[null,null,null,"TRANSPORTISTA"]
[]
["NOMBRE OPERADOR:",null,null,null,"FIRMA:"]
["VEHICULO",null,null,null,"FECHA DE SERVICIO:"]
["MARCA:",null,null,null,"MODELO:",null,"PLACAS:"]
["# ECONOMICO:"]
["CAP.TANQUE:"]
["HORA INICIO",null,null,null,"HORA FINAL:",null,"TOTAL HRS:"]
["KM INICIAL:",null,null,null,"KM FINAL:",null,"TOTAL KMS:",null,"OBSERVACIONES"]
[null,null,null,"DESTINATARIO:"]
["EMPRESA:",null,null,null,"FECHA Y HORA DE RECEPCION:"]
["DIRECCION:",null,null,null,"TELEFONO:"]
["RESPONSABLE:",null,null,null,"FIRMA:",null,null,null,"ENTREGO",null,null,"RECIBIO"]
["(81)9688.7618",null,"ventas@ecoseptic.mx",null,null,null,null,null,null,"Nombre:"]
[null,null,null,null,null,"www.ecoseptic.mx",null,null,null,"Fecha:"]
["Ave.A #710 y Ave.3, Central de Carga,Guadalupe N.l CP 67129",null,null,null,null,"CONSTRUCTORA INVERMEX S.A DE C.V.",null,null,"Los trabajos anteriores fueron ejecutados y recibidos a nuestra entera satisfaccion y conformidad el dia ",null,null,null,null,null," "]

{"sheet":"INFORMACION DE CLIENTES","index":2,"n_rows":413,"n_cols":19,"rows_kept":413,"cut":false,"hidden":false,"merged":[]}
["CLIENTE","NOMBRE","COLONIA","CALLE","MUNICIPIO","ESTADO","TELEFONO","No. ECOLOGIA","ASESOR COMERCIAL "]
[294,"A4C-SANKIN PRECISION TUBE",null,"AMALFI","PESQUERIA","NUEVO LEON",8123533756,null,"SARAI SOLIS "]
[104,"ABASTOS Y SERVICIOS MOTRICES  S.A DE C.V.","FRACC. PARQUE INDUSTRIAL LA SILLA","AV. DE LA LIBERTAD","GUADALUPE","NUEVO LEON",8182990243,null,"INVERMEX"]
[11,"ACERO PRIME S DE RL DE CV","ZONA INDUSTRIAL","EJE 128","SAN LUIS","POTOSI",8180005301,"134/066","INVERMEX"]
[323,"ACUMULADORES OMEGA S.A. DE C.V. ","LADRILLERA ","CARR. PESQUERIA KM 1 ","PESQUERIA","NUEVO LEON",81419000,"05/2014","SARAI SOLIS "]
[250,"ADMINISTRACION DE SERVICIOS ESPECIALIZADOS ASESA, SA DE CV","SAN FERNANDO LA HERRADURA",null,"HUIXQUILUCAN","ESTADO DE MÉXICO",5544280277,null,"INVERMEX"]
[2,"ADMINISTRADORA DEL MERCADO DE ABASTOS ESTRELLA S.A DE C.V",null,"AV. LOS ANGELES 1000 OTE COL. MERCADO DE ABASTOS ESTRELLA","SAN NICOLAS DE LOS GARZA","NUEVO LEON",8183511533,null,"INVERMEX"]
[220,"ADVANCED TECHNOLOGIES EQUIPMENT AND SERVICES S.A. DE C.V.","MARIA LUISA",null,"MONTERREY","NUEVO LEON",null,null,"INVERMEX"]
[3,"AGRONUTRIENTES DEL NORTE S.A DE C.V",null,"CARRETERA A COLOMBIA","ESCOBEDO","NUEVO LEON",8181545669,"DGIA-FS-83","LAURA ENRIQUEZ"]
[353,"AISLANTES INDUSTRIALES DE MONTERREY","COYOACAN","LOS ANDES","MONTERREY","NUEVO LEON",8183558062,"19/EV-0111/02/23","SARAI SOLIS "]
[105,"ALEJANDRA GARCIA CAMACHO","CUMBRE SAN ANGEL","PRIVADA MONACO","MONTERREY","NUEVO LEON",8111637965,null,"SARAI SOLIS "]
[1,"ALEN DEL NORTE S.A DE C.V",null,"BLVD. DIAZ ORDAZ #1000","SANTA CATARINA","NUEVO LEON",8181221000,"17/804","LAURA ENRIQUEZ"]
[204,"ALFA OMEGA Y PLUS A9","LA ESTANCIA 4TO SECTOR",null,"SAN NICOLAS DE LOS GARZA","NUEVO LEON",null,null,"LUIS CASTILLO"]
[406,"ALTERIVER",null,"CARR. MONTERREY-COLOMBIA KM 11.5  ","SALINAS VICTORIA","NUEVO LEON",8110164402,"FI-445","LAURA ENRIQUEZ"]
[160,"ALTERUVER","GUERRERO","AVE. GUERRERO","NUEVO LAREDO","TAMAULIPAS",9621468622,"DGIA-FS-89","V3-LAURA"]
[117,"ALTOS HORNOS DE MEXICO S.A.B.  DE C.V","LA LOMA",null,null,"COAHUILA",null,null,"INVERMEX"]
[null,"AMIGOS DEL PATRONATO DE CERRALVO POR LA CONSERVACION DEL MEDIO AMBIENTE","DEL VALLE","CALZADA DEL VALLE ","SAN PEDRO GARZA GARCIA","NUEVO LEON",8110817961,null,"LAURA ENRIQUEZ"]
[5,"ANA GABRIELA  GONZALEZ OVALLE","VILLAS  SOL","TOMASITA VILLARREAL",null,"NUEVO LEON",8119341095,null,"INVERMEX"]
[125,"ANA GABRIELA OROZCO ZUÑIGA","ANDRES CABALLERO","FIDEL VELAZQUEZ","ESCOBEDO","NUEVO LEON",null,"FSI-358","LUIS CASTILLO"]
[274,"ANDERTON CASTINGS S. DE R.L. DE C.V.","PARQUE INDUSTRIAL LAS AMERICAS",null,"APODACA","NUEVO LEON","(81)8863-2020",null,"N/A"]
[172,"ANDRES TREJO SILVA","VILLAS CAMPESTRE",null,"CIENEGA DE FLORES","NUEVO LEON",null,null,"INVERMEX"]
[289,"ANTRIAVI","PEDRO RAMIREZ VAZQUEZ","DEL VALLE ORIENTE","SAN PEDRO GARZA GARCÍA","NUEVO LEÓN",8281144848,"DGIA2/2021","SARAI SOLIS "]
[187,"AQUA MEX S.A. DE C.V.","INDUSTRIAL EL LECHUGAL",null,"SANTA CATARINA","NUEVO LEON",null,null,"INVERMEX"]
[423,"AQUA SYSTEMS TECNOLOGIA EN AGUA","LOS ALTOS","LA BARCA","MONTERREY","NUEVO LEON",8128610945,"INTERNO","ALEJANDRA ALONSO"]
[402,"ARCELORMITTAL TUBULAR PRODUCTA MONTERREY","ARCO VIAL","CARR MONTERREY SALTILLO KM 28.2","ESCOBEDO","NUEVO LEON",9932223953,"38/2013","LUIS CASTILLO"]
[135,"ARENDAL, S.A DE C.V.","VALLE ORIENTE SECCION LOMA LARGA",null,null,"NUEVO LEON",null,null,"VERACRUZ"]
[106,"ARRENDADORA Y CONSTRUCTORA DEVCOR S.A DE C.V.","PETROLERA","PROLONGACION AGUA DULCE","TAMPICO","TAMAULIPAS",null,null,"VERACRUZ"]
[226,"ARRENDADORA Y FACTOR BANORTE,S.A DE C.V. SOCIEDAD FINANCIERA DE OBJETO MULTIPLE,ENTIDAD REGULADA,GRUPO FINANCIERO BANORT","DEL VALLE ORIENTE",null,"SAN PEDRO GARZA GARCIA","NUEVO LEON",null,null,"N/A"]
[12,"ARTEXA MEXICO S.A. DE C.V.","LA ESTANZUELA VIEJA","CAÑON GRANDE","MONTERREY","NUEVO LEON",null,null,"LUIS CASTILLO"]
[150,"ARTIGRAF S.A DE C.V.",null,"Km 1.2 S/N, Carretera a Garcia","SANTA CATARINA","NUEVO LEON",8181227300,"INTERNO","LAURA ENRIQUEZ"]
[154,"ASOCIACION DE VECINOS COLONIA ANTARA AC","ANTARA RESIDENCIAL",null,"MONTERREY","NUEVO LEON",null,null,"INVERMEX"]
[189,"ASOCIACION DE VECINOS DEL PARQUE INDUSTRIAL MILIMEX CF",null,null,null,null,null,null,"INVERMEX"]
[199,"AUTOLAVADO BOSQUES SA DE CV","EL URO",null,"MONTERREY","NUEVO LEON",null,null,"INVERMEX"]
[4,"AUTOTRANSPORTES ESPECIALIZADOS ALFA S.A DE C.V",null,"CARRETERA LIBRAMIENTO NORESTE KM 19.5","ESCOBEDO","NUEVO LEON",8118717942,null,"INVERMEX"]
[396,"AUTOTRANSPORTES LA FLECHA","INDUSTRIAL VALLEJO","PONIENTE 140","AZCAPOTZALCO","NUEVO LEON",8120018767,"FI-459","INVERMEX"]
[212,"AYVI S.A. DE C.V.","EX HACIENDA SANTA ROSA",null,"APODACA","NUEVO LEON",null,null,"INVERMEX"]
[6,"BACHOCO PPA","INDUSTRIAL","AVENIDA TECNOLOGICO","CELAYA","GUANAJUATO",8180420200,"FSI-317","LAURA ENRIQUEZ"]
[111,"BACHOCO S.A DE C.V  (INCUBADORA)","CIUDAD INDUSTRIAL","AVENIDA TECNOLOGICO",null,"GUANAJUATO",null,"FSI-316","LAURA ENRIQUEZ"]
[110,"BACHOCO S.A DE C.V  (SALINAS VICTORIA)","CIUDAD INDUSTRIAL","AVENIDA TECNOLOGICO",null,"GUANAJUATO",null,"FSI-298","LAURA ENRIQUEZ"]
[null,"BACHOCO S.A DE C.V  (SALINAS VICTORIA)","CIUDAD INDUSTRIAL","AVENIDA TECNOLOGICO",null,"GUANAJUATO",null,"FSI-298","LAURA ENRIQUEZ"]
[107,"BAFISHCO S.A DE C.V.",null,"AV. MIGUEL ALEMAN","GUADALUPE","NUEVO LEON",null,null,"INVERMEX"]
[245,"BARRY CALLEBAUT MEXICO S DE RL DE CV",null,"AVE. INDUSTRIAS DEL PONIENTE","ESCOBEDO","NUEVO LEON",8122002518,null,"LUIS CASTILLO"]
[367,"BASAL MONTERREY","PARQUE INDUSTRIAL HUINALA","INTERNACIONAL","APODACA","NUEVO LEON",null,"INTERNO","SARAI SOLIS "]
["163-1","BEBIDAS MUNDIALES",null,null,"GUADALUPE","NUEVO LEON",null,"009/2006","LAURA ENRIQUEZ"]
[163,"BEBIDAS MUNDIALES S DE RL DE CV","REGINA","AV. ALFONSO REYES NTE #3001","MONTERREY","NUEVO LEON",null,"319/2018","LAURA ENRIQUEZ"]
[370,"BILLARES POOL CASASOL","BUENOS AIRES","REVOLUCION","MONTERREY","NUEVO LEON",8183792779,null,"LUIS CASTILLO"]
[217,"BOMBAS Y BANDAS TERMOPLASTICAS S.A. DE C.V.","ZONA CENTRO",null,"APODACA","NUEVO LEON",null,null,"INVERMEX"]
[7,"BOMBAS Y MEDIDORES DEL NORTE S.A DEC.V","RINCON DE SAN MIGUEL","ORO","APODACA","NUEVO LEON",8110890812,null,"INVERMEX"]
[8,"BOTANAS Y DERIVADOS S.A DE C.V","PARQUE INDUSTRIAL KALOS","HESTIA","GUADALUPE","NUEVO LEON",8183840409,"FSI-202","LUIS CASTILLO"]
[9,"BRIDGESTONE NEUMATICOS DE MONTERREY S.A DE C.V","CIENEGA DE FLORES","AVENIDA DEL PARQUE 1000 FRACC.INDUSTRIAL MTY. TECH PARK","CIENEGA DE FLORES","NUEVO LEON",8181549227,"170/06","LAURA ENRIQUEZ"]
[112,"BUENO ALIMENTOS S.A DE C.V","FRACC. IN. UNIDAD NACIONAL","CARRETERA A SALTILLO",null,"NUEVO LEON",null,null,"INVERMEX"]
[13,"C1 ALEMANA S.A. DE C.V.","JARDIN DEL OBISPADO","Av. Jose Eleuterio Gonzalez","MONTERREY","NUEVO LEON",null,null,"LUIS CASTILLO"]
[127,"CAJA BUENOS AIRES SC DE AP DE RL DE CV","UNION MODELO",null,null,"NUEVO LEON",null,null,"INVERMEX"]
[228,"CALIDAD TOTAL EN CERAMICA  S A P I DE C V","ZONA INDUSTRIAL EL LECHUGAL","ANTIGUO CAMINO A LA HUASTECA","SANTA CATARINA","NUEVO LEON",null,"INTERNO ","LUIS CASTILLO"]
[321,"CALII-MARKET","RESIDENCIAL SANTA BARBARA 1 SECTOR","AV. LAZARO CARDENAS #1007 INT. 502","SAN PEDRO GARZA GARCIA","NUEVO LEÓN",null,"INTERNO","INVERMEX"]
[300,"CAMARA NACIONAL DE COMERCIO , SERVICIOS Y TURISMO DE MONTERREY","MONTERREY CENTRO","MELCHOR OCAMPO PONIENTE ","MONTERREY ","NUEVO LEON",null,"INTERNO ","INVERMEX"]
[255,"CARBOGRAF INDUSTRIAL, SA DE CV","PESQUERIA","CARR. MIGUEL ALEMAN KM 29.8","PESQUERIA","NUEVO LEON",81164422004,"12/2014","LUIS CASTILLO"]
[248,"CARGILL DE MEXICO, SA DE CV","SANTA FE",null,"DISTRITO FEDERAL","DISTRITO FEDERAL",null,null,"VERACRUZ"]
[261,"CARGILL PROTEIN S DE RL DE CV","SANTA FE","AV. ANTONIO DOVALI JAIME #70 TORRE C Y D PISO 11","ALVARO OBREGÓN","CIUDAD DE MÉXICO",null,null,"V3-LAURA ENRIQUEZ"]
[361,"CARLOS BLANCO MARTINEZ","SALTILLO 2000","ALMENDRO #701","SALTILLO","COAHUILA",8110490775,"INTERNO","INVERMEX"]
{"$rows_left_out":353}